{"text_format":"3","workbook":"xlsx","n_sheets":6,"sheets":["How to use the sheets","Formula","CDV & Degradability 2016","CDV & Degradability 2023","DID-list 2016","DID-list 2023"],"not_rendered":{"images":2,"defined_names":4,"comments":1},"read":"whole","date_system":"1900"}

{"sheet":"How to use the sheets","index":0,"n_rows":14,"n_cols":1,"rows_kept":14}
["Below is explanations for the different sheets in this excel file and information on how they are to be used"]
[]
["The purpose of the sheet is to in an harmonised way communicate the formulation that you are applying on to the Nordic Ecolabel. The formulation is also the basis for the calculation done in the CDV-sheet.\n\nOn the formula-sheet the formulation of the product is to be specified. All ingoing substances are to be specified (exception; perfumes and dyes are not to be split up to their ingoing chemicals).\n\nIngoing substances are defined as all substances in the Nordic Swan Ecolabelled cosmetic product, including additives (e.g. preservatives and stabilisers) in the raw materials. Substances known to be released from ingoing substances (e.g. formaldehyde, arylamine, in situ-generated preservatives) are also regarded as ingoing substances\n\nImpurities in raw material is not to be listed on the formula sheet; Impurities are defined as residuals, pollutants, contaminants etc. from production, incl. production of raw materials that remain in the raw material/ingredient and/or in the in the Nordic Swan Ecolabelled product in concentrations less than 100 ppm (0,0100 w-%, 100 mg/kg) in the Nordic Swan Ecolabelled rinse off product. Impurities of over 1.0% concentration in the raw material are regarded as constituent chemicals.\n\nIf you have two or more alternative raw material suppliers of the same raw material please write all the suppliers in the column \"Raw material producer\"\n\nIf an raw material contains two or more chemicals the raw material will be listed several times in the column \"Raw material trade name\". For example, if an raw material contains 2 chemicals then the raw material name will be listed two times in the column \"Raw material trade name\" and the two different chemicals in column \"Chemical name of ingoing chemicals in the raw material\". The same logic is for the column \"% of the raw material in the product\" where the same value will be added on both rows and in the column \"% of the specific chemical in raw material (excluding water)\" the active concentration of the specific chemical in the raw material will be listed."]
["Example:"]
[]
["Light grey cells (in the formulation sheet):\nShall contain information about the raw material as a whole"]
["Dark grey cells (in the formulation sheet):\nShall contain information about the specific ingoing chemical in the raw material"]
[]
["Sheet \"CDV\""]
["This sheet calculates the CDV-value for the product and also the content of environmental hazardous substances in the product. This calculation is based on the information given in the \"Formula\"-sheet\n\nFor raw material/chemicals that does not have an DID-number in the formulation-sheet values for toxicity an degradation needs to be added manually (columns E, F, G, J and K)"]
{"$rows_left_out":5}
{"sheet":"Formula","index":1,"n_rows":5,"n_cols":22,"rows_kept":5}
["Product name:"]
["Type of product:"]
["Product volume:"]
["Standard dose in grams"]
["Internal raw material code (voluntary)","Raw material producer","Raw material trade name","% of the raw material in the product","Chemical name of ingoing substance in the raw material","% of the specific substance in raw material (excluding water)","CAS# of the specific chemical","Function of the specific chemical","DID# (2007 DID-list) of the specific chemical","DID# (2014 DID-list) of the specific chemical","DID# (2016 DID-list) of the specific chemical","DID# (2023 DID-list) of the specific chemical","Classification raw material","Classification of the specific chemical","In the raw material write the percentage of substances classified with H410","In the raw material write the percentage of substances classified with H411","In the raw material write the percentage of substances classified with H412","In the raw material write the percentage of substances classified with H317","In the raw material write the percentage of substances classified with H334","Do you have appendix 2 for this  raw material","Do you have SDS for this  raw material","Comments"]

{"sheet":"CDV & Degradability 2016","index":2,"n_rows":53,"n_cols":16,"rows_kept":53,"merged":[[0,0,0,8],[2,4,2,5],[39,11,39,12],[40,11,40,12],[41,11,41,12],[42,8,42,9],[43,1,44,7],[43,8,43,9],[44,8,44,9],[45,1,46,7],[45,8,45,9],[46,8,46,9],[47,8,47,9],[49,11,49,12],[50,11,50,12],[51,8,51,10],[51,11,51,12],[52,1,54,7],[52,8,52,9],[53,8,53,9],[54,8,54,9],[55,8,55,9],[56,8,56,9]]}
["If the ingredient does not have a DID2016-number, also fill in column E, F, G, J and K"]
[]
[null,"Name of product:",null,{"$f":"IF(Formula!B1=0,\"\",Formula!B1)","v":""},"Standard dose in grams:",null,{"$f":"IF(Formula!B4=\"\",\"\",Formula!B4)","v":""}]
[null,"Type of product: ",null,{"$f":"IF(Formula!B2=0,\"\",Formula!B2)","v":""}]
["DID-no.","DID-no. Ingredient name","Raw material trade name","Chemical name (given in formula)","TF(chron)","TF(acute)","DF","Active content (%)","mg/dose","aNBO mg/dose"," anNBO mg/dose","CDV(chron) (l/dose)","∑ H410","∑ H411","∑ H412","∑ (H410*100 + H411*10 + H412)"]
[{"$f":"IF(Formula!K6=0,\"\",Formula!K6)","v":""},{"$f":"IF(C6=\"\",\"\",IF(A6=\"\",NonDID,IFERROR(VLOOKUP(A6,'DID-list 2016'!$A$5:$K$350,2,0),Invalid)))","v":""},{"$f":"IF(Formula!C6=0,\"\",Formula!C6)","v":""},{"$f":"IF(Formula!E6=0,\"\",Formula!E6)","v":""},{"$f":"IFERROR(VLOOKUP($A6,'DID-list 2016'!$A$7:$K$350,8,0),\"\")","v":""},{"$f":"IFERROR(VLOOKUP($A6,'DID-list 2016'!$A$7:$K$350,5,0),\"\")","v":""},{"$f":"IFERROR(VLOOKUP($A6,'DID-list 2016'!$A$7:$K$350,9,0),\"\")","v":""},{"$f":"IF(Formula!D6*(Formula!F6/100)=0,\"\",Formula!D6*(Formula!F6/100))","v":""},{"$f":"IF(H6=\"\",\"\",($H6/100*1000)*$G$3)","v":""},{"$f":"IFERROR(IF(VLOOKUP($A6,'DID-list 2016'!$A$7:$K$350,10,0)=\"R\",0,$I6)*OR(IF(VLOOKUP($A6,'DID-list 2016'!$A$7:$K$350,10,0)=\"NA\",0,$I6)),$I6)","v":""},{"$f":"IFERROR(IF(VLOOKUP($A6,'DID-list 2016'!$A$7:$K$350,11,0)=\"Y\",0,$I6)*OR(IF(VLOOKUP($A6,'DID-list 2016'!$A$7:$K$350,11,0)=\"NA\",0,$I6)),$I6)","v":""},{"$f":"IFERROR($I6*$G6/$E6,\"\")","v":""},{"$f":"IF(H6=\"\",\"\",IF(H6*Formula!O6=0,\"\",H6*Formula!O6))","v":""},{"$f":"IF(H6=\"\",\"\",IF(H6*Formula!P6=0,\"\",H6*Formula!P6))","v":""},{"$f":"IF(H6=\"\",\"\",IF(H6*Formula!Q6=0,\"\",H6*Formula!Q6))","v":""},{"$f":"IF(100*IF(M6=\"\",0,M6)+10*IF(N6=\"\",0,N6)+IF(O6=\"\",0,O6)=0,\"\",(100*IF(M6=\"\",0,M6)+10*IF(N6=\"\",0,N6)+IF(O6=\"\",0,O6)))","v":""}]
[{"$f":"IF(Formula!K7=0,\"\",Formula!K7)","v":""},{"$f":"IF(C7=\"\",\"\",IF(A7=\"\",NonDID,IFERROR(VLOOKUP(A7,'DID-list 2016'!$A$5:$K$350,2,0),Invalid)))","v":""},{"$f":"IF(Formula!C7=0,\"\",Formula!C7)","v":""},{"$f":"IF(Formula!E7=0,\"\",Formula!E7)","v":""},{"$f":"IFERROR(VLOOKUP($A7,'DID-list 2016'!$A$7:$K$350,8,0),\"\")","v":""},{"$f":"IFERROR(VLOOKUP($A7,'DID-list 2016'!$A$7:$K$350,5,0),\"\")","v":""},{"$f":"IFERROR(VLOOKUP($A7,'DID-list 2016'!$A$7:$K$350,9,0),\"\")","v":""},{"$f":"IF(Formula!D7*(Formula!F7/100)=0,\"\",Formula!D7*(Formula!F7/100))","v":""},"",{"$f":"IFERROR(IF(VLOOKUP($A7,'DID-list 2016'!$A$7:$K$350,10,0)=\"R\",0,$I7)*OR(IF(VLOOKUP($A7,'DID-list 2016'!$A$7:$K$350,10,0)=\"NA\",0,$I7)),$I7)","v":""},{"$f":"IFERROR(IF(VLOOKUP($A7,'DID-list 2016'!$A$7:$K$350,11,0)=\"Y\",0,$I7)*OR(IF(VLOOKUP($A7,'DID-list 2016'!$A$7:$K$350,11,0)=\"NA\",0,$I7)),$I7)","v":""},"",{"$f":"IF(H7=\"\",\"\",IF(H7*Formula!O7=0,\"\",H7*Formula!O7))","v":""},{"$f":"IF(H7=\"\",\"\",IF(H7*Formula!P7=0,\"\",H7*Formula!P7))","v":""},{"$f":"IF(H7=\"\",\"\",IF(H7*Formula!Q7=0,\"\",H7*Formula!Q7))","v":""},{"$f":"IF(100*IF(M7=\"\",0,M7)+10*IF(N7=\"\",0,N7)+IF(O7=\"\",0,O7)=0,\"\",(100*IF(M7=\"\",0,M7)+10*IF(N7=\"\",0,N7)+IF(O7=\"\",0,O7)))","v":""}]
[{"$f":"IF(Formula!K8=0,\"\",Formula!K8)","v":""},{"$f":"IF(C8=\"\",\"\",IF(A8=\"\",NonDID,IFERROR(VLOOKUP(A8,'DID-list 2016'!$A$5:$K$350,2,0),Invalid)))","v":""},{"$f":"IF(Formula!C8=0,\"\",Formula!C8)","v":""},{"$f":"IF(Formula!E8=0,\"\",Formula!E8)","v":""},{"$f":"IFERROR(VLOOKUP($A8,'DID-list 2016'!$A$7:$K$350,8,0),\"\")","v":""},{"$f":"IFERROR(VLOOKUP($A8,'DID-list 2016'!$A$7:$K$350,5,0),\"\")","v":""},{"$f":"IFERROR(VLOOKUP($A8,'DID-list 2016'!$A$7:$K$350,9,0),\"\")","v":""},{"$f":"IF(Formula!D8*(Formula!F8/100)=0,\"\",Formula!D8*(Formula!F8/100))","v":""},"",{"$f":"IFERROR(IF(VLOOKUP($A8,'DID-list 2016'!$A$7:$K$350,10,0)=\"R\",0,$I8)*OR(IF(VLOOKUP($A8,'DID-list 2016'!$A$7:$K$350,10,0)=\"NA\",0,$I8)),$I8)","v":""},{"$f":"IFERROR(IF(VLOOKUP($A8,'DID-list 2016'!$A$7:$K$350,11,0)=\"Y\",0,$I8)*OR(IF(VLOOKUP($A8,'DID-list 2016'!$A$7:$K$350,11,0)=\"NA\",0,$I8)),$I8)","v":""},"",{"$f":"IF(H8=\"\",\"\",IF(H8*Formula!O8=0,\"\",H8*Formula!O8))","v":""},{"$f":"IF(H8=\"\",\"\",IF(H8*Formula!P8=0,\"\",H8*Formula!P8))","v":""},{"$f":"IF(H8=\"\",\"\",IF(H8*Formula!Q8=0,\"\",H8*Formula!Q8))","v":""},""]
[{"$f":"IF(Formula!K9=0,\"\",Formula!K9)","v":""},{"$f":"IF(C9=\"\",\"\",IF(A9=\"\",NonDID,IFERROR(VLOOKUP(A9,'DID-list 2016'!$A$5:$K$350,2,0),Invalid)))","v":""},{"$f":"IF(Formula!C9=0,\"\",Formula!C9)","v":""},{"$f":"IF(Formula!E9=0,\"\",Formula!E9)","v":""},{"$f":"IFERROR(VLOOKUP($A9,'DID-list 2016'!$A$7:$K$350,8,0),\"\")","v":""},{"$f":"IFERROR(VLOOKUP($A9,'DID-list 2016'!$A$7:$K$350,5,0),\"\")","v":""},{"$f":"IFERROR(VLOOKUP($A9,'DID-list 2016'!$A$7:$K$350,9,0),\"\")","v":""},{"$f":"IF(Formula!D9*(Formula!F9/100)=0,\"\",Formula!D9*(Formula!F9/100))","v":""},"",{"$f":"IFERROR(IF(VLOOKUP($A9,'DID-list 2016'!$A$7:$K$350,10,0)=\"R\",0,$I9)*OR(IF(VLOOKUP($A9,'DID-list 2016'!$A$7:$K$350,10,0)=\"NA\",0,$I9)),$I9)","v":""},{"$f":"IFERROR(IF(VLOOKUP($A9,'DID-list 2016'!$A$7:$K$350,11,0)=\"Y\",0,$I9)*OR(IF(VLOOKUP($A9,'DID-list 2016'!$A$7:$K$350,11,0)=\"NA\",0,$I9)),$I9)","v":""},"",{"$f":"IF(H9=\"\",\"\",IF(H9*Formula!O9=0,\"\",H9*Formula!O9))","v":""},{"$f":"IF(H9=\"\",\"\",IF(H9*Formula!P9=0,\"\",H9*Formula!P9))","v":""},{"$f":"IF(H9=\"\",\"\",IF(H9*Formula!Q9=0,\"\",H9*Formula!Q9))","v":""},""]
[{"$f":"IF(Formula!K10=0,\"\",Formula!K10)","v":""},{"$f":"IF(C10=\"\",\"\",IF(A10=\"\",NonDID,IFERROR(VLOOKUP(A10,'DID-list 2016'!$A$5:$K$350,2,0),Invalid)))","v":""},{"$f":"IF(Formula!C10=0,\"\",Formula!C10)","v":""},{"$f":"IF(Formula!E10=0,\"\",Formula!E10)","v":""},{"$f":"IFERROR(VLOOKUP($A10,'DID-list 2016'!$A$7:$K$350,8,0),\"\")","v":""},{"$f":"IFERROR(VLOOKUP($A10,'DID-list 2016'!$A$7:$K$350,5,0),\"\")","v":""},{"$f":"IFERROR(VLOOKUP($A10,'DID-list 2016'!$A$7:$K$350,9,0),\"\")","v":""},{"$f":"IF(Formula!D10*(Formula!F10/100)=0,\"\",Formula!D10*(Formula!F10/100))","v":""},"",{"$f":"IFERROR(IF(VLOOKUP($A10,'DID-list 2016'!$A$7:$K$350,10,0)=\"R\",0,$I10)*OR(IF(VLOOKUP($A10,'DID-list 2016'!$A$7:$K$350,10,0)=\"NA\",0,$I10)),$I10)","v":""},{"$f":"IFERROR(IF(VLOOKUP($A10,'DID-list 2016'!$A$7:$K$350,11,0)=\"Y\",0,$I10)*OR(IF(VLOOKUP($A10,'DID-list 2016'!$A$7:$K$350,11,0)=\"NA\",0,$I10)),$I10)","v":""},"",{"$f":"IF(H10=\"\",\"\",IF(H10*Formula!O10=0,\"\",H10*Formula!O10))","v":""},{"$f":"IF(H10=\"\",\"\",IF(H10*Formula!P10=0,\"\",H10*Formula!P10))","v":""},{"$f":"IF(H10=\"\",\"\",IF(H10*Formula!Q10=0,\"\",H10*Formula!Q10))","v":""},""]
{"$rows_left_out":44}
{"sheet":"CDV & Degradability 2023","index":3,"n_rows":53,"n_cols":16,"rows_kept":53,"merged":[[0,0,0,8],[2,4,2,5],[39,11,39,12],[40,11,40,12],[41,11,41,12],[42,8,42,9],[43,1,44,7],[43,8,43,9],[44,8,44,9],[45,1,46,7],[45,8,45,9],[46,8,46,9],[47,8,47,9],[49,11,49,12],[50,11,50,12],[51,8,51,10],[51,11,51,12],[52,1,54,7],[52,8,52,9],[53,8,53,9],[54,8,54,9],[55,8,55,9],[56,8,56,9]]}
["If the ingredient does not have a DID2023-number, also fill in column E, F, G, J and K"]
[]
[null,"Name of product:",null,{"$f":"IF(Formula!B1=0,\"\",Formula!B1)","v":""},"Standard dose in grams:",null,{"$f":"IF(Formula!B4=\"\",\"\",Formula!B4)","v":""}]
[null,"Type of product: ",null,{"$f":"IF(Formula!B2=0,\"\",Formula!B2)","v":""}]
["DID-no.","DID-no. Ingredient name","Raw material trade name","Chemical name (given in formula)","TF(chron)","TF(acute)","DF","Active content (%)","mg/dose","aNBO mg/dose"," anNBO mg/dose","CDV(chron) (l/dose)","∑ H410","∑ H411","∑ H412","∑ (H410*100 + H411*10 + H412)"]
[{"$f":"IF(Formula!L6=0,\"\",Formula!L6)","v":""},{"$f":"IF(C6=\"\",\"\",IF(A6=\"\",NonDID,IFERROR(VLOOKUP(A6,'DID-list 2023'!$A$5:$K$350,2,0),Invalid)))","v":""},{"$f":"IF(Formula!C6=0,\"\",Formula!C6)","v":""},{"$f":"IF(Formula!E6=0,\"\",Formula!E6)","v":""},{"$f":"IFERROR(VLOOKUP($A6,'DID-list 2023'!$A$7:$K$350,8,0),\"\")","v":""},{"$f":"IFERROR(VLOOKUP($A6,'DID-list 2023'!$A$7:$K$350,5,0),\"\")","v":""},{"$f":"IFERROR(VLOOKUP($A6,'DID-list 2023'!$A$7:$K$350,9,0),\"\")","v":""},{"$f":"IF(Formula!D6*(Formula!F6/100)=0,\"\",Formula!D6*(Formula!F6/100))","v":""},{"$f":"IF(H6=\"\",\"\",($H6/100*1000)*$G$3)","v":""},{"$f":"IFERROR(IF(VLOOKUP($A6,'DID-list 2023'!$A$7:$K$350,10,0)=\"R\",0,$I6)*OR(IF(VLOOKUP($A6,'DID-list 2023'!$A$7:$K$350,10,0)=\"NA\",0,$I6)),$I6)","v":""},{"$f":"IFERROR(IF(VLOOKUP($A6,'DID-list 2023'!$A$7:$K$350,11,0)=\"Y\",0,$I6)*OR(IF(VLOOKUP($A6,'DID-list 2023'!$A$7:$K$350,11,0)=\"NA\",0,$I6)),$I6)","v":""},{"$f":"IFERROR($I6*$G6/$E6,\"\")","v":""},{"$f":"IF(H6=\"\",\"\",IF(H6*Formula!O6=0,\"\",H6*Formula!O6))","v":""},{"$f":"IF(H6=\"\",\"\",IF(H6*Formula!P6=0,\"\",H6*Formula!P6))","v":""},{"$f":"IF(H6=\"\",\"\",IF(H6*Formula!Q6=0,\"\",H6*Formula!Q6))","v":""},{"$f":"IF(100*IF(M6=\"\",0,M6)+10*IF(N6=\"\",0,N6)+IF(O6=\"\",0,O6)=0,\"\",(100*IF(M6=\"\",0,M6)+10*IF(N6=\"\",0,N6)+IF(O6=\"\",0,O6)))","v":""}]
[{"$f":"IF(Formula!L7=0,\"\",Formula!L7)","v":""},{"$f":"IF(C7=\"\",\"\",IF(A7=\"\",NonDID,IFERROR(VLOOKUP(A7,'DID-list 2023'!$A$5:$K$350,2,0),Invalid)))","v":""},{"$f":"IF(Formula!C7=0,\"\",Formula!C7)","v":""},{"$f":"IF(Formula!E7=0,\"\",Formula!E7)","v":""},{"$f":"IFERROR(VLOOKUP($A7,'DID-list 2023'!$A$7:$K$350,8,0),\"\")","v":""},{"$f":"IFERROR(VLOOKUP($A7,'DID-list 2023'!$A$7:$K$350,5,0),\"\")","v":""},{"$f":"IFERROR(VLOOKUP($A7,'DID-list 2023'!$A$7:$K$350,9,0),\"\")","v":""},{"$f":"IF(Formula!D7*(Formula!F7/100)=0,\"\",Formula!D7*(Formula!F7/100))","v":""},"",{"$f":"IFERROR(IF(VLOOKUP($A7,'DID-list 2023'!$A$7:$K$350,10,0)=\"R\",0,$I7)*OR(IF(VLOOKUP($A7,'DID-list 2023'!$A$7:$K$350,10,0)=\"NA\",0,$I7)),$I7)","v":""},{"$f":"IFERROR(IF(VLOOKUP($A7,'DID-list 2023'!$A$7:$K$350,11,0)=\"Y\",0,$I7)*OR(IF(VLOOKUP($A7,'DID-list 2023'!$A$7:$K$350,11,0)=\"NA\",0,$I7)),$I7)","v":""},"",{"$f":"IF(H7=\"\",\"\",IF(H7*Formula!O7=0,\"\",H7*Formula!O7))","v":""},{"$f":"IF(H7=\"\",\"\",IF(H7*Formula!P7=0,\"\",H7*Formula!P7))","v":""},{"$f":"IF(H7=\"\",\"\",IF(H7*Formula!Q7=0,\"\",H7*Formula!Q7))","v":""},{"$f":"IF(100*IF(M7=\"\",0,M7)+10*IF(N7=\"\",0,N7)+IF(O7=\"\",0,O7)=0,\"\",(100*IF(M7=\"\",0,M7)+10*IF(N7=\"\",0,N7)+IF(O7=\"\",0,O7)))","v":""}]
[{"$f":"IF(Formula!L8=0,\"\",Formula!L8)","v":""},{"$f":"IF(C8=\"\",\"\",IF(A8=\"\",NonDID,IFERROR(VLOOKUP(A8,'DID-list 2023'!$A$5:$K$350,2,0),Invalid)))","v":""},{"$f":"IF(Formula!C8=0,\"\",Formula!C8)","v":""},{"$f":"IF(Formula!E8=0,\"\",Formula!E8)","v":""},{"$f":"IFERROR(VLOOKUP($A8,'DID-list 2023'!$A$7:$K$350,8,0),\"\")","v":""},{"$f":"IFERROR(VLOOKUP($A8,'DID-list 2023'!$A$7:$K$350,5,0),\"\")","v":""},{"$f":"IFERROR(VLOOKUP($A8,'DID-list 2023'!$A$7:$K$350,9,0),\"\")","v":""},{"$f":"IF(Formula!D8*(Formula!F8/100)=0,\"\",Formula!D8*(Formula!F8/100))","v":""},"",{"$f":"IFERROR(IF(VLOOKUP($A8,'DID-list 2023'!$A$7:$K$350,10,0)=\"R\",0,$I8)*OR(IF(VLOOKUP($A8,'DID-list 2023'!$A$7:$K$350,10,0)=\"NA\",0,$I8)),$I8)","v":""},{"$f":"IFERROR(IF(VLOOKUP($A8,'DID-list 2023'!$A$7:$K$350,11,0)=\"Y\",0,$I8)*OR(IF(VLOOKUP($A8,'DID-list 2023'!$A$7:$K$350,11,0)=\"NA\",0,$I8)),$I8)","v":""},"",{"$f":"IF(H8=\"\",\"\",IF(H8*Formula!O8=0,\"\",H8*Formula!O8))","v":""},{"$f":"IF(H8=\"\",\"\",IF(H8*Formula!P8=0,\"\",H8*Formula!P8))","v":""},{"$f":"IF(H8=\"\",\"\",IF(H8*Formula!Q8=0,\"\",H8*Formula!Q8))","v":""},""]
[{"$f":"IF(Formula!L9=0,\"\",Formula!L9)","v":""},{"$f":"IF(C9=\"\",\"\",IF(A9=\"\",NonDID,IFERROR(VLOOKUP(A9,'DID-list 2023'!$A$5:$K$350,2,0),Invalid)))","v":""},{"$f":"IF(Formula!C9=0,\"\",Formula!C9)","v":""},{"$f":"IF(Formula!E9=0,\"\",Formula!E9)","v":""},{"$f":"IFERROR(VLOOKUP($A9,'DID-list 2023'!$A$7:$K$350,8,0),\"\")","v":""},{"$f":"IFERROR(VLOOKUP($A9,'DID-list 2023'!$A$7:$K$350,5,0),\"\")","v":""},{"$f":"IFERROR(VLOOKUP($A9,'DID-list 2023'!$A$7:$K$350,9,0),\"\")","v":""},{"$f":"IF(Formula!D9*(Formula!F9/100)=0,\"\",Formula!D9*(Formula!F9/100))","v":""},"",{"$f":"IFERROR(IF(VLOOKUP($A9,'DID-list 2023'!$A$7:$K$350,10,0)=\"R\",0,$I9)*OR(IF(VLOOKUP($A9,'DID-list 2023'!$A$7:$K$350,10,0)=\"NA\",0,$I9)),$I9)","v":""},{"$f":"IFERROR(IF(VLOOKUP($A9,'DID-list 2023'!$A$7:$K$350,11,0)=\"Y\",0,$I9)*OR(IF(VLOOKUP($A9,'DID-list 2023'!$A$7:$K$350,11,0)=\"NA\",0,$I9)),$I9)","v":""},"",{"$f":"IF(H9=\"\",\"\",IF(H9*Formula!O9=0,\"\",H9*Formula!O9))","v":""},{"$f":"IF(H9=\"\",\"\",IF(H9*Formula!P9=0,\"\",H9*Formula!P9))","v":""},{"$f":"IF(H9=\"\",\"\",IF(H9*Formula!Q9=0,\"\",H9*Formula!Q9))","v":""},""]
[{"$f":"IF(Formula!L10=0,\"\",Formula!L10)","v":""},{"$f":"IF(C10=\"\",\"\",IF(A10=\"\",NonDID,IFERROR(VLOOKUP(A10,'DID-list 2023'!$A$5:$K$350,2,0),Invalid)))","v":""},{"$f":"IF(Formula!C10=0,\"\",Formula!C10)","v":""},{"$f":"IF(Formula!E10=0,\"\",Formula!E10)","v":""},{"$f":"IFERROR(VLOOKUP($A10,'DID-list 2023'!$A$7:$K$350,8,0),\"\")","v":""},{"$f":"IFERROR(VLOOKUP($A10,'DID-list 2023'!$A$7:$K$350,5,0),\"\")","v":""},{"$f":"IFERROR(VLOOKUP($A10,'DID-list 2023'!$A$7:$K$350,9,0),\"\")","v":""},{"$f":"IF(Formula!D10*(Formula!F10/100)=0,\"\",Formula!D10*(Formula!F10/100))","v":""},"",{"$f":"IFERROR(IF(VLOOKUP($A10,'DID-list 2023'!$A$7:$K$350,10,0)=\"R\",0,$I10)*OR(IF(VLOOKUP($A10,'DID-list 2023'!$A$7:$K$350,10,0)=\"NA\",0,$I10)),$I10)","v":""},{"$f":"IFERROR(IF(VLOOKUP($A10,'DID-list 2023'!$A$7:$K$350,11,0)=\"Y\",0,$I10)*OR(IF(VLOOKUP($A10,'DID-list 2023'!$A$7:$K$350,11,0)=\"NA\",0,$I10)),$I10)","v":""},"",{"$f":"IF(H10=\"\",\"\",IF(H10*Formula!O10=0,\"\",H10*Formula!O10))","v":""},{"$f":"IF(H10=\"\",\"\",IF(H10*Formula!P10=0,\"\",H10*Formula!P10))","v":""},{"$f":"IF(H10=\"\",\"\",IF(H10*Formula!Q10=0,\"\",H10*Formula!Q10))","v":""},""]
{"$rows_left_out":44}
{"sheet":"DID-list 2016","index":4,"n_rows":284,"n_cols":12,"rows_kept":284,"merged":[[4,2,4,4],[4,5,4,7],[4,8,4,10]]}
[]
[]
["Detergents Ingredients Database, version 2016"]
[{"$nulls":9},"                                         "]
[null,null,"Acute toxicity",null,null,"Chronic toxicity",null,null,"Degradation"]
["DID-no","Ingredient name","LC50/ EC50 (*)","SF (*) (Acute)","TF    (Acute)","NOEC (*)","SF (*) (Chronic)","TF    (Chronic)","DF","Aerobic ","Anaerobic ","Leverandør erklæring modtaget (angiv licensnr + virksomhed)"]
[null,"Anionic surfactants"]
[2001,"C10-13 linear alkyl benzene sulphonates",4.1,1000,{"$f":"C8/D8","v":4.0999999999999995E-3},0.69,10,{"$f":"F8/G8","v":0.06899999999999999},0.05,"R","N"]
[2002,"C14-16 Alkyl sulphonate",6.7,5000,1.34E-3,0.5,10,0.05,0.05,"R","N"]
[2003,"C8-10 Alkyl sulphate",40,1000,0.04,1.35,10,{"$f":"F10/G10","v":0.135},0.05,"R","Y"]
{"$rows_left_out":275}
{"sheet":"DID-list 2023","index":5,"n_rows":308,"n_cols":11,"rows_kept":308,"merged":[[4,2,4,4],[4,5,4,7],[4,8,4,10]]}
[]
[]
["Detergents Ingredients Database, version 2023"]
[{"$nulls":9},"                                         "]
[null,null,"Acute toxicity",null,null,"Chronic toxicity",null,null,"Degradation"]
["DID-no","Ingredient name","LC50/ EC50 (*)","SF (*) (Acute)","TF    (Acute)","NOEC (*)","SF (*) (Chronic)","TF    (Chronic)","DF","Aerobic ","Anaerobic "]
[null,"Anionic surfactants"]
[2001,"C10-13 linear alkyl benzene sulphonates",4.1,1000,{"$f":"C8/D8","v":4.0999999999999995E-3},0.69,10,{"$f":"F8/G8","v":0.06899999999999999},0.05,"R","N"]
[2002,"C14-16 Alkyl sulphonate",6.7,5000,{"$f":"C9/D9","v":1.34E-3},0.5,10,{"$f":"F9/G9","v":0.05},0.05,"R","N"]
[2003,"C8-10 Alkyl sulphate",40,1000,{"$f":"C10/D10","v":0.04},1.35,10,{"$f":"F10/G10","v":0.135},0.05,"R","Y"]
{"$rows_left_out":298}