{"text_format":"3","workbook":"xlsx","n_sheets":6,"sheets":["How to use the sheets","Formula","CDV & Degradability 2016","CDV & Degradability 2023","DID-list 2016","DID-list 2023"],"not_rendered":{"images":2,"defined_names":4,"comments":1},"read":"whole","date_system":"1900"}

{"sheet":"How to use the sheets","index":0,"n_rows":14,"n_cols":1,"rows_kept":14}
["Below is explanations for the different sheets in this excel file and information on how they are to be used"]
[]
["The purpose of the sheet is to in an harmonised way communicate the formulation that you are applying on to the Nordic Ecolabel. The formulation is also the basis for the calculation done in the CDV-sheet.\n\nOn the formula-sheet the formulation of the product is to be specified. All ingoing substances are to be specified (exception; perfumes and dyes are not to be split up to their ingoing chemicals).\n\nIngoing substances are defined as all substances in the Nordic Swan Ecolabelled cosmetic product, including additives (e.g. preservatives and stabilisers) in the raw materials. Substances known to be released from ingoing substances (e.g. formaldehyde, arylamine, in situ-generated preservatives) are also regarded as ingoing substances\n\nImpurities in raw material is not to be listed on the formula sheet; Impurities are defined as residuals, pollutants, contaminants etc. from production, incl. production of raw materials that remain in the raw material/ingredient and/or in the in the Nordic Swan Ecolabelled product in concentrations less than 100 ppm (0,0100 w-%, 100 mg/kg) in the Nordic Swan Ecolabelled rinse off product. Impurities of over 1.0% concentration in the raw material are regarded as constituent chemicals.\n\nIf you have two or more alternative raw material suppliers of the same raw material please write all the suppliers in the column \"Raw material producer\"\n\nIf an raw material contains two or more chemicals the raw material will be listed several times in the column \"Raw material trade name\". For example, if an raw material contains 2 chemicals then the raw material name will be listed two times in the column \"Raw material trade name\" and the two different chemicals in column \"Chemical name of ingoing chemicals in the raw material\". The same logic is for the column \"% of the raw material in the product\" where the same value will be added on both rows and in the column \"% of the specific chemical in raw material (excluding water)\" the active concentration of the specific chemical in the raw material will be listed."]
["Example:"]
[]
["Light grey cells (in the formulation sheet):\nShall contain information about the raw material as a whole"]
["Dark grey cells (in the formulation sheet):\nShall contain information about the specific ingoing chemical in the raw material"]
[]
["Sheet \"CDV\""]
["This sheet calculates the CDV-value for the product and also the content of environmental hazardous substances in the product. This calculation is based on the information given in the \"Formula\"-sheet\n\nFor raw material/chemicals that does not have an DID-number in the formulation-sheet values for toxicity an degradation needs to be added manually (columns E, F, G, J and K)"]
[]
[]
["Sheet \"DID-list\""]
["This sheet contains info from the DID-list and is used for the CDV-calculation"]

{"sheet":"Formula","index":1,"n_rows":5,"n_cols":22,"rows_kept":5}
["Product name:"]
["Type of product:"]
["Product volume:"]
["Standard dose in grams"]
["Internal raw material code (voluntary)","Raw material producer","Raw material trade name","% of the raw material in the product","Chemical name of ingoing substance in the raw material","% of the specific substance in raw material (excluding water)","CAS# of the specific chemical","Function of the specific chemical","DID# (2007 DID-list) of the specific chemical","DID# (2014 DID-list) of the specific chemical","DID# (2016 DID-list) of the specific chemical","DID# (2023 DID-list) of the specific chemical","Classification raw material","Classification of the specific chemical","In the raw material write the percentage of substances classified with H410","In the raw material write the percentage of substances classified with H411","In the raw material write the percentage of substances classified with H412","In the raw material write the percentage of substances classified with H317","In the raw material write the percentage of substances classified with H334","Do you have appendix 2 for this  raw material","Do you have SDS for this  raw material","Comments"]

{"sheet":"CDV & Degradability 2016","index":2,"n_rows":53,"n_cols":16,"rows_kept":53,"merged":[[0,0,0,8],[2,4,2,5],[39,11,39,12],[40,11,40,12],[41,11,41,12],[42,8,42,9],[43,1,44,7],[43,8,43,9],[44,8,44,9],[45,1,46,7],[45,8,45,9],[46,8,46,9],[47,8,47,9],[49,11,49,12],[50,11,50,12],[51,8,51,10],[51,11,51,12],[52,1,54,7],[52,8,52,9],[53,8,53,9],[54,8,54,9],[55,8,55,9],[56,8,56,9]]}
["If the ingredient does not have a DID2016-number, also fill in column E, F, G, J and K"]
[]
[null,"Name of product:",null,{"$f":"IF(Formula!B1=0,\"\",Formula!B1)","v":""},"Standard dose in grams:",null,{"$f":"IF(Formula!B4=\"\",\"\",Formula!B4)","v":""}]
[null,"Type of product: ",null,{"$f":"IF(Formula!B2=0,\"\",Formula!B2)","v":""}]
["DID-no.","DID-no. Ingredient name","Raw material trade name","Chemical name (given in formula)","TF(chron)","TF(acute)","DF","Active content (%)","mg/dose","aNBO mg/dose"," anNBO mg/dose","CDV(chron) (l/dose)","∑ H410","∑ H411","∑ H412","∑ (H410*100 + H411*10 + H412)"]
[{"$f":"IF(Formula!K6=0,\"\",Formula!K6)","v":""},{"$f":"IF(C6=\"\",\"\",IF(A6=\"\",NonDID,IFERROR(VLOOKUP(A6,'DID-list 2016'!$A$5:$K$350,2,0),Invalid)))","v":""},{"$f":"IF(Formula!C6=0,\"\",Formula!C6)","v":""},{"$f":"IF(Formula!E6=0,\"\",Formula!E6)","v":""},{"$f":"IFERROR(VLOOKUP($A6,'DID-list 2016'!$A$7:$K$350,8,0),\"\")","v":""},{"$f":"IFERROR(VLOOKUP($A6,'DID-list 2016'!$A$7:$K$350,5,0),\"\")","v":""},{"$f":"IFERROR(VLOOKUP($A6,'DID-list 2016'!$A$7:$K$350,9,0),\"\")","v":""},{"$f":"IF(Formula!D6*(Formula!F6/100)=0,\"\",Formula!D6*(Formula!F6/100))","v":""},{"$f":"IF(H6=\"\",\"\",($H6/100*1000)*$G$3)","v":""},{"$f":"IFERROR(IF(VLOOKUP($A6,'DID-list 2016'!$A$7:$K$350,10,0)=\"R\",0,$I6)*OR(IF(VLOOKUP($A6,'DID-list 2016'!$A$7:$K$350,10,0)=\"NA\",0,$I6)),$I6)","v":""},{"$f":"IFERROR(IF(VLOOKUP($A6,'DID-list 2016'!$A$7:$K$350,11,0)=\"Y\",0,$I6)*OR(IF(VLOOKUP($A6,'DID-list 2016'!$A$7:$K$350,11,0)=\"NA\",0,$I6)),$I6)","v":""},{"$f":"IFERROR($I6*$G6/$E6,\"\")","v":""},{"$f":"IF(H6=\"\",\"\",IF(H6*Formula!O6=0,\"\",H6*Formula!O6))","v":""},{"$f":"IF(H6=\"\",\"\",IF(H6*Formula!P6=0,\"\",H6*Formula!P6))","v":""},{"$f":"IF(H6=\"\",\"\",IF(H6*Formula!Q6=0,\"\",H6*Formula!Q6))","v":""},{"$f":"IF(100*IF(M6=\"\",0,M6)+10*IF(N6=\"\",0,N6)+IF(O6=\"\",0,O6)=0,\"\",(100*IF(M6=\"\",0,M6)+10*IF(N6=\"\",0,N6)+IF(O6=\"\",0,O6)))","v":""}]
[{"$f":"IF(Formula!K7=0,\"\",Formula!K7)","v":""},{"$f":"IF(C7=\"\",\"\",IF(A7=\"\",NonDID,IFERROR(VLOOKUP(A7,'DID-list 2016'!$A$5:$K$350,2,0),Invalid)))","v":""},{"$f":"IF(Formula!C7=0,\"\",Formula!C7)","v":""},{"$f":"IF(Formula!E7=0,\"\",Formula!E7)","v":""},{"$f":"IFERROR(VLOOKUP($A7,'DID-list 2016'!$A$7:$K$350,8,0),\"\")","v":""},{"$f":"IFERROR(VLOOKUP($A7,'DID-list 2016'!$A$7:$K$350,5,0),\"\")","v":""},{"$f":"IFERROR(VLOOKUP($A7,'DID-list 2016'!$A$7:$K$350,9,0),\"\")","v":""},{"$f":"IF(Formula!D7*(Formula!F7/100)=0,\"\",Formula!D7*(Formula!F7/100))","v":""},"",{"$f":"IFERROR(IF(VLOOKUP($A7,'DID-list 2016'!$A$7:$K$350,10,0)=\"R\",0,$I7)*OR(IF(VLOOKUP($A7,'DID-list 2016'!$A$7:$K$350,10,0)=\"NA\",0,$I7)),$I7)","v":""},{"$f":"IFERROR(IF(VLOOKUP($A7,'DID-list 2016'!$A$7:$K$350,11,0)=\"Y\",0,$I7)*OR(IF(VLOOKUP($A7,'DID-list 2016'!$A$7:$K$350,11,0)=\"NA\",0,$I7)),$I7)","v":""},"",{"$f":"IF(H7=\"\",\"\",IF(H7*Formula!O7=0,\"\",H7*Formula!O7))","v":""},{"$f":"IF(H7=\"\",\"\",IF(H7*Formula!P7=0,\"\",H7*Formula!P7))","v":""},{"$f":"IF(H7=\"\",\"\",IF(H7*Formula!Q7=0,\"\",H7*Formula!Q7))","v":""},{"$f":"IF(100*IF(M7=\"\",0,M7)+10*IF(N7=\"\",0,N7)+IF(O7=\"\",0,O7)=0,\"\",(100*IF(M7=\"\",0,M7)+10*IF(N7=\"\",0,N7)+IF(O7=\"\",0,O7)))","v":""}]
[{"$f":"IF(Formula!K8=0,\"\",Formula!K8)","v":""},{"$f":"IF(C8=\"\",\"\",IF(A8=\"\",NonDID,IFERROR(VLOOKUP(A8,'DID-list 2016'!$A$5:$K$350,2,0),Invalid)))","v":""},{"$f":"IF(Formula!C8=0,\"\",Formula!C8)","v":""},{"$f":"IF(Formula!E8=0,\"\",Formula!E8)","v":""},{"$f":"IFERROR(VLOOKUP($A8,'DID-list 2016'!$A$7:$K$350,8,0),\"\")","v":""},{"$f":"IFERROR(VLOOKUP($A8,'DID-list 2016'!$A$7:$K$350,5,0),\"\")","v":""},{"$f":"IFERROR(VLOOKUP($A8,'DID-list 2016'!$A$7:$K$350,9,0),\"\")","v":""},{"$f":"IF(Formula!D8*(Formula!F8/100)=0,\"\",Formula!D8*(Formula!F8/100))","v":""},"",{"$f":"IFERROR(IF(VLOOKUP($A8,'DID-list 2016'!$A$7:$K$350,10,0)=\"R\",0,$I8)*OR(IF(VLOOKUP($A8,'DID-list 2016'!$A$7:$K$350,10,0)=\"NA\",0,$I8)),$I8)","v":""},{"$f":"IFERROR(IF(VLOOKUP($A8,'DID-list 2016'!$A$7:$K$350,11,0)=\"Y\",0,$I8)*OR(IF(VLOOKUP($A8,'DID-list 2016'!$A$7:$K$350,11,0)=\"NA\",0,$I8)),$I8)","v":""},"",{"$f":"IF(H8=\"\",\"\",IF(H8*Formula!O8=0,\"\",H8*Formula!O8))","v":""},{"$f":"IF(H8=\"\",\"\",IF(H8*Formula!P8=0,\"\",H8*Formula!P8))","v":""},{"$f":"IF(H8=\"\",\"\",IF(H8*Formula!Q8=0,\"\",H8*Formula!Q8))","v":""},""]
[{"$f":"IF(Formula!K9=0,\"\",Formula!K9)","v":""},{"$f":"IF(C9=\"\",\"\",IF(A9=\"\",NonDID,IFERROR(VLOOKUP(A9,'DID-list 2016'!$A$5:$K$350,2,0),Invalid)))","v":""},{"$f":"IF(Formula!C9=0,\"\",Formula!C9)","v":""},{"$f":"IF(Formula!E9=0,\"\",Formula!E9)","v":""},{"$f":"IFERROR(VLOOKUP($A9,'DID-list 2016'!$A$7:$K$350,8,0),\"\")","v":""},{"$f":"IFERROR(VLOOKUP($A9,'DID-list 2016'!$A$7:$K$350,5,0),\"\")","v":""},{"$f":"IFERROR(VLOOKUP($A9,'DID-list 2016'!$A$7:$K$350,9,0),\"\")","v":""},{"$f":"IF(Formula!D9*(Formula!F9/100)=0,\"\",Formula!D9*(Formula!F9/100))","v":""},"",{"$f":"IFERROR(IF(VLOOKUP($A9,'DID-list 2016'!$A$7:$K$350,10,0)=\"R\",0,$I9)*OR(IF(VLOOKUP($A9,'DID-list 2016'!$A$7:$K$350,10,0)=\"NA\",0,$I9)),$I9)","v":""},{"$f":"IFERROR(IF(VLOOKUP($A9,'DID-list 2016'!$A$7:$K$350,11,0)=\"Y\",0,$I9)*OR(IF(VLOOKUP($A9,'DID-list 2016'!$A$7:$K$350,11,0)=\"NA\",0,$I9)),$I9)","v":""},"",{"$f":"IF(H9=\"\",\"\",IF(H9*Formula!O9=0,\"\",H9*Formula!O9))","v":""},{"$f":"IF(H9=\"\",\"\",IF(H9*Formula!P9=0,\"\",H9*Formula!P9))","v":""},{"$f":"IF(H9=\"\",\"\",IF(H9*Formula!Q9=0,\"\",H9*Formula!Q9))","v":""},""]
[{"$f":"IF(Formula!K10=0,\"\",Formula!K10)","v":""},{"$f":"IF(C10=\"\",\"\",IF(A10=\"\",NonDID,IFERROR(VLOOKUP(A10,'DID-list 2016'!$A$5:$K$350,2,0),Invalid)))","v":""},{"$f":"IF(Formula!C10=0,\"\",Formula!C10)","v":""},{"$f":"IF(Formula!E10=0,\"\",Formula!E10)","v":""},{"$f":"IFERROR(VLOOKUP($A10,'DID-list 2016'!$A$7:$K$350,8,0),\"\")","v":""},{"$f":"IFERROR(VLOOKUP($A10,'DID-list 2016'!$A$7:$K$350,5,0),\"\")","v":""},{"$f":"IFERROR(VLOOKUP($A10,'DID-list 2016'!$A$7:$K$350,9,0),\"\")","v":""},{"$f":"IF(Formula!D10*(Formula!F10/100)=0,\"\",Formula!D10*(Formula!F10/100))","v":""},"",{"$f":"IFERROR(IF(VLOOKUP($A10,'DID-list 2016'!$A$7:$K$350,10,0)=\"R\",0,$I10)*OR(IF(VLOOKUP($A10,'DID-list 2016'!$A$7:$K$350,10,0)=\"NA\",0,$I10)),$I10)","v":""},{"$f":"IFERROR(IF(VLOOKUP($A10,'DID-list 2016'!$A$7:$K$350,11,0)=\"Y\",0,$I10)*OR(IF(VLOOKUP($A10,'DID-list 2016'!$A$7:$K$350,11,0)=\"NA\",0,$I10)),$I10)","v":""},"",{"$f":"IF(H10=\"\",\"\",IF(H10*Formula!O10=0,\"\",H10*Formula!O10))","v":""},{"$f":"IF(H10=\"\",\"\",IF(H10*Formula!P10=0,\"\",H10*Formula!P10))","v":""},{"$f":"IF(H10=\"\",\"\",IF(H10*Formula!Q10=0,\"\",H10*Formula!Q10))","v":""},""]
[{"$f":"IF(Formula!K11=0,\"\",Formula!K11)","v":""},{"$f":"IF(C11=\"\",\"\",IF(A11=\"\",NonDID,IFERROR(VLOOKUP(A11,'DID-list 2016'!$A$5:$K$350,2,0),Invalid)))","v":""},{"$f":"IF(Formula!C11=0,\"\",Formula!C11)","v":""},{"$f":"IF(Formula!E11=0,\"\",Formula!E11)","v":""},{"$f":"IFERROR(VLOOKUP($A11,'DID-list 2016'!$A$7:$K$350,8,0),\"\")","v":""},{"$f":"IFERROR(VLOOKUP($A11,'DID-list 2016'!$A$7:$K$350,5,0),\"\")","v":""},{"$f":"IFERROR(VLOOKUP($A11,'DID-list 2016'!$A$7:$K$350,9,0),\"\")","v":""},{"$f":"IF(Formula!D11*(Formula!F11/100)=0,\"\",Formula!D11*(Formula!F11/100))","v":""},"",{"$f":"IFERROR(IF(VLOOKUP($A11,'DID-list 2016'!$A$7:$K$350,10,0)=\"R\",0,$I11)*OR(IF(VLOOKUP($A11,'DID-list 2016'!$A$7:$K$350,10,0)=\"NA\",0,$I11)),$I11)","v":""},{"$f":"IFERROR(IF(VLOOKUP($A11,'DID-list 2016'!$A$7:$K$350,11,0)=\"Y\",0,$I11)*OR(IF(VLOOKUP($A11,'DID-list 2016'!$A$7:$K$350,11,0)=\"NA\",0,$I11)),$I11)","v":""},"",{"$f":"IF(H11=\"\",\"\",IF(H11*Formula!O11=0,\"\",H11*Formula!O11))","v":""},{"$f":"IF(H11=\"\",\"\",IF(H11*Formula!P11=0,\"\",H11*Formula!P11))","v":""},{"$f":"IF(H11=\"\",\"\",IF(H11*Formula!Q11=0,\"\",H11*Formula!Q11))","v":""},""]
[{"$f":"IF(Formula!K12=0,\"\",Formula!K12)","v":""},{"$f":"IF(C12=\"\",\"\",IF(A12=\"\",NonDID,IFERROR(VLOOKUP(A12,'DID-list 2016'!$A$5:$K$350,2,0),Invalid)))","v":""},{"$f":"IF(Formula!C12=0,\"\",Formula!C12)","v":""},{"$f":"IF(Formula!E12=0,\"\",Formula!E12)","v":""},{"$f":"IFERROR(VLOOKUP($A12,'DID-list 2016'!$A$7:$K$350,8,0),\"\")","v":""},{"$f":"IFERROR(VLOOKUP($A12,'DID-list 2016'!$A$7:$K$350,5,0),\"\")","v":""},{"$f":"IFERROR(VLOOKUP($A12,'DID-list 2016'!$A$7:$K$350,9,0),\"\")","v":""},{"$f":"IF(Formula!D12*(Formula!F12/100)=0,\"\",Formula!D12*(Formula!F12/100))","v":""},"",{"$f":"IFERROR(IF(VLOOKUP($A12,'DID-list 2016'!$A$7:$K$350,10,0)=\"R\",0,$I12)*OR(IF(VLOOKUP($A12,'DID-list 2016'!$A$7:$K$350,10,0)=\"NA\",0,$I12)),$I12)","v":""},{"$f":"IFERROR(IF(VLOOKUP($A12,'DID-list 2016'!$A$7:$K$350,11,0)=\"Y\",0,$I12)*OR(IF(VLOOKUP($A12,'DID-list 2016'!$A$7:$K$350,11,0)=\"NA\",0,$I12)),$I12)","v":""},"",{"$f":"IF(H12=\"\",\"\",IF(H12*Formula!O12=0,\"\",H12*Formula!O12))","v":""},{"$f":"IF(H12=\"\",\"\",IF(H12*Formula!P12=0,\"\",H12*Formula!P12))","v":""},{"$f":"IF(H12=\"\",\"\",IF(H12*Formula!Q12=0,\"\",H12*Formula!Q12))","v":""},""]
[{"$f":"IF(Formula!K13=0,\"\",Formula!K13)","v":""},{"$f":"IF(C13=\"\",\"\",IF(A13=\"\",NonDID,IFERROR(VLOOKUP(A13,'DID-list 2016'!$A$5:$K$350,2,0),Invalid)))","v":""},{"$f":"IF(Formula!C13=0,\"\",Formula!C13)","v":""},{"$f":"IF(Formula!E13=0,\"\",Formula!E13)","v":""},{"$f":"IFERROR(VLOOKUP($A13,'DID-list 2016'!$A$7:$K$350,8,0),\"\")","v":""},{"$f":"IFERROR(VLOOKUP($A13,'DID-list 2016'!$A$7:$K$350,5,0),\"\")","v":""},{"$f":"IFERROR(VLOOKUP($A13,'DID-list 2016'!$A$7:$K$350,9,0),\"\")","v":""},{"$f":"IF(Formula!D13*(Formula!F13/100)=0,\"\",Formula!D13*(Formula!F13/100))","v":""},"",{"$f":"IFERROR(IF(VLOOKUP($A13,'DID-list 2016'!$A$7:$K$350,10,0)=\"R\",0,$I13)*OR(IF(VLOOKUP($A13,'DID-list 2016'!$A$7:$K$350,10,0)=\"NA\",0,$I13)),$I13)","v":""},{"$f":"IFERROR(IF(VLOOKUP($A13,'DID-list 2016'!$A$7:$K$350,11,0)=\"Y\",0,$I13)*OR(IF(VLOOKUP($A13,'DID-list 2016'!$A$7:$K$350,11,0)=\"NA\",0,$I13)),$I13)","v":""},"",{"$f":"IF(H13=\"\",\"\",IF(H13*Formula!O13=0,\"\",H13*Formula!O13))","v":""},{"$f":"IF(H13=\"\",\"\",IF(H13*Formula!P13=0,\"\",H13*Formula!P13))","v":""},{"$f":"IF(H13=\"\",\"\",IF(H13*Formula!Q13=0,\"\",H13*Formula!Q13))","v":""},""]
[{"$f":"IF(Formula!K14=0,\"\",Formula!K14)","v":""},{"$f":"IF(C14=\"\",\"\",IF(A14=\"\",NonDID,IFERROR(VLOOKUP(A14,'DID-list 2016'!$A$5:$K$350,2,0),Invalid)))","v":""},{"$f":"IF(Formula!C14=0,\"\",Formula!C14)","v":""},{"$f":"IF(Formula!E14=0,\"\",Formula!E14)","v":""},{"$f":"IFERROR(VLOOKUP($A14,'DID-list 2016'!$A$7:$K$350,8,0),\"\")","v":""},{"$f":"IFERROR(VLOOKUP($A14,'DID-list 2016'!$A$7:$K$350,5,0),\"\")","v":""},{"$f":"IFERROR(VLOOKUP($A14,'DID-list 2016'!$A$7:$K$350,9,0),\"\")","v":""},{"$f":"IF(Formula!D14*(Formula!F14/100)=0,\"\",Formula!D14*(Formula!F14/100))","v":""},"",{"$f":"IFERROR(IF(VLOOKUP($A14,'DID-list 2016'!$A$7:$K$350,10,0)=\"R\",0,$I14)*OR(IF(VLOOKUP($A14,'DID-list 2016'!$A$7:$K$350,10,0)=\"NA\",0,$I14)),$I14)","v":""},{"$f":"IFERROR(IF(VLOOKUP($A14,'DID-list 2016'!$A$7:$K$350,11,0)=\"Y\",0,$I14)*OR(IF(VLOOKUP($A14,'DID-list 2016'!$A$7:$K$350,11,0)=\"NA\",0,$I14)),$I14)","v":""},"",{"$f":"IF(H14=\"\",\"\",IF(H14*Formula!O14=0,\"\",H14*Formula!O14))","v":""},{"$f":"IF(H14=\"\",\"\",IF(H14*Formula!P14=0,\"\",H14*Formula!P14))","v":""},{"$f":"IF(H14=\"\",\"\",IF(H14*Formula!Q14=0,\"\",H14*Formula!Q14))","v":""},""]
[{"$f":"IF(Formula!K15=0,\"\",Formula!K15)","v":""},{"$f":"IF(C15=\"\",\"\",IF(A15=\"\",NonDID,IFERROR(VLOOKUP(A15,'DID-list 2016'!$A$5:$K$350,2,0),Invalid)))","v":""},{"$f":"IF(Formula!C15=0,\"\",Formula!C15)","v":""},{"$f":"IF(Formula!E15=0,\"\",Formula!E15)","v":""},{"$f":"IFERROR(VLOOKUP($A15,'DID-list 2016'!$A$7:$K$350,8,0),\"\")","v":""},{"$f":"IFERROR(VLOOKUP($A15,'DID-list 2016'!$A$7:$K$350,5,0),\"\")","v":""},{"$f":"IFERROR(VLOOKUP($A15,'DID-list 2016'!$A$7:$K$350,9,0),\"\")","v":""},{"$f":"IF(Formula!D15*(Formula!F15/100)=0,\"\",Formula!D15*(Formula!F15/100))","v":""},"",{"$f":"IFERROR(IF(VLOOKUP($A15,'DID-list 2016'!$A$7:$K$350,10,0)=\"R\",0,$I15)*OR(IF(VLOOKUP($A15,'DID-list 2016'!$A$7:$K$350,10,0)=\"NA\",0,$I15)),$I15)","v":""},{"$f":"IFERROR(IF(VLOOKUP($A15,'DID-list 2016'!$A$7:$K$350,11,0)=\"Y\",0,$I15)*OR(IF(VLOOKUP($A15,'DID-list 2016'!$A$7:$K$350,11,0)=\"NA\",0,$I15)),$I15)","v":""},"",{"$f":"IF(H15=\"\",\"\",IF(H15*Formula!O15=0,\"\",H15*Formula!O15))","v":""},{"$f":"IF(H15=\"\",\"\",IF(H15*Formula!P15=0,\"\",H15*Formula!P15))","v":""},{"$f":"IF(H15=\"\",\"\",IF(H15*Formula!Q15=0,\"\",H15*Formula!Q15))","v":""},""]
[{"$f":"IF(Formula!K16=0,\"\",Formula!K16)","v":""},{"$f":"IF(C16=\"\",\"\",IF(A16=\"\",NonDID,IFERROR(VLOOKUP(A16,'DID-list 2016'!$A$5:$K$350,2,0),Invalid)))","v":""},{"$f":"IF(Formula!C16=0,\"\",Formula!C16)","v":""},{"$f":"IF(Formula!E16=0,\"\",Formula!E16)","v":""},{"$f":"IFERROR(VLOOKUP($A16,'DID-list 2016'!$A$7:$K$350,8,0),\"\")","v":""},{"$f":"IFERROR(VLOOKUP($A16,'DID-list 2016'!$A$7:$K$350,5,0),\"\")","v":""},{"$f":"IFERROR(VLOOKUP($A16,'DID-list 2016'!$A$7:$K$350,9,0),\"\")","v":""},{"$f":"IF(Formula!D16*(Formula!F16/100)=0,\"\",Formula!D16*(Formula!F16/100))","v":""},"",{"$f":"IFERROR(IF(VLOOKUP($A16,'DID-list 2016'!$A$7:$K$350,10,0)=\"R\",0,$I16)*OR(IF(VLOOKUP($A16,'DID-list 2016'!$A$7:$K$350,10,0)=\"NA\",0,$I16)),$I16)","v":""},{"$f":"IFERROR(IF(VLOOKUP($A16,'DID-list 2016'!$A$7:$K$350,11,0)=\"Y\",0,$I16)*OR(IF(VLOOKUP($A16,'DID-list 2016'!$A$7:$K$350,11,0)=\"NA\",0,$I16)),$I16)","v":""},"",{"$f":"IF(H16=\"\",\"\",IF(H16*Formula!O16=0,\"\",H16*Formula!O16))","v":""},{"$f":"IF(H16=\"\",\"\",IF(H16*Formula!P16=0,\"\",H16*Formula!P16))","v":""},{"$f":"IF(H16=\"\",\"\",IF(H16*Formula!Q16=0,\"\",H16*Formula!Q16))","v":""},""]
[{"$f":"IF(Formula!K17=0,\"\",Formula!K17)","v":""},{"$f":"IF(C17=\"\",\"\",IF(A17=\"\",NonDID,IFERROR(VLOOKUP(A17,'DID-list 2016'!$A$5:$K$350,2,0),Invalid)))","v":""},{"$f":"IF(Formula!C17=0,\"\",Formula!C17)","v":""},{"$f":"IF(Formula!E17=0,\"\",Formula!E17)","v":""},{"$f":"IFERROR(VLOOKUP($A17,'DID-list 2016'!$A$7:$K$350,8,0),\"\")","v":""},{"$f":"IFERROR(VLOOKUP($A17,'DID-list 2016'!$A$7:$K$350,5,0),\"\")","v":""},{"$f":"IFERROR(VLOOKUP($A17,'DID-list 2016'!$A$7:$K$350,9,0),\"\")","v":""},{"$f":"IF(Formula!D17*(Formula!F17/100)=0,\"\",Formula!D17*(Formula!F17/100))","v":""},"",{"$f":"IFERROR(IF(VLOOKUP($A17,'DID-list 2016'!$A$7:$K$350,10,0)=\"R\",0,$I17)*OR(IF(VLOOKUP($A17,'DID-list 2016'!$A$7:$K$350,10,0)=\"NA\",0,$I17)),$I17)","v":""},{"$f":"IFERROR(IF(VLOOKUP($A17,'DID-list 2016'!$A$7:$K$350,11,0)=\"Y\",0,$I17)*OR(IF(VLOOKUP($A17,'DID-list 2016'!$A$7:$K$350,11,0)=\"NA\",0,$I17)),$I17)","v":""},"",{"$f":"IF(H17=\"\",\"\",IF(H17*Formula!O17=0,\"\",H17*Formula!O17))","v":""},{"$f":"IF(H17=\"\",\"\",IF(H17*Formula!P17=0,\"\",H17*Formula!P17))","v":""},{"$f":"IF(H17=\"\",\"\",IF(H17*Formula!Q17=0,\"\",H17*Formula!Q17))","v":""},""]
[{"$f":"IF(Formula!K18=0,\"\",Formula!K18)","v":""},{"$f":"IF(C18=\"\",\"\",IF(A18=\"\",NonDID,IFERROR(VLOOKUP(A18,'DID-list 2016'!$A$5:$K$350,2,0),Invalid)))","v":""},{"$f":"IF(Formula!C18=0,\"\",Formula!C18)","v":""},{"$f":"IF(Formula!E18=0,\"\",Formula!E18)","v":""},{"$f":"IFERROR(VLOOKUP($A18,'DID-list 2016'!$A$7:$K$350,8,0),\"\")","v":""},{"$f":"IFERROR(VLOOKUP($A18,'DID-list 2016'!$A$7:$K$350,5,0),\"\")","v":""},{"$f":"IFERROR(VLOOKUP($A18,'DID-list 2016'!$A$7:$K$350,9,0),\"\")","v":""},{"$f":"IF(Formula!D18*(Formula!F18/100)=0,\"\",Formula!D18*(Formula!F18/100))","v":""},"",{"$f":"IFERROR(IF(VLOOKUP($A18,'DID-list 2016'!$A$7:$K$350,10,0)=\"R\",0,$I18)*OR(IF(VLOOKUP($A18,'DID-list 2016'!$A$7:$K$350,10,0)=\"NA\",0,$I18)),$I18)","v":""},{"$f":"IFERROR(IF(VLOOKUP($A18,'DID-list 2016'!$A$7:$K$350,11,0)=\"Y\",0,$I18)*OR(IF(VLOOKUP($A18,'DID-list 2016'!$A$7:$K$350,11,0)=\"NA\",0,$I18)),$I18)","v":""},"",{"$f":"IF(H18=\"\",\"\",IF(H18*Formula!O18=0,\"\",H18*Formula!O18))","v":""},{"$f":"IF(H18=\"\",\"\",IF(H18*Formula!P18=0,\"\",H18*Formula!P18))","v":""},{"$f":"IF(H18=\"\",\"\",IF(H18*Formula!Q18=0,\"\",H18*Formula!Q18))","v":""},""]
[{"$f":"IF(Formula!K19=0,\"\",Formula!K19)","v":""},{"$f":"IF(C19=\"\",\"\",IF(A19=\"\",NonDID,IFERROR(VLOOKUP(A19,'DID-list 2016'!$A$5:$K$350,2,0),Invalid)))","v":""},{"$f":"IF(Formula!C19=0,\"\",Formula!C19)","v":""},{"$f":"IF(Formula!E19=0,\"\",Formula!E19)","v":""},{"$f":"IFERROR(VLOOKUP($A19,'DID-list 2016'!$A$7:$K$350,8,0),\"\")","v":""},{"$f":"IFERROR(VLOOKUP($A19,'DID-list 2016'!$A$7:$K$350,5,0),\"\")","v":""},{"$f":"IFERROR(VLOOKUP($A19,'DID-list 2016'!$A$7:$K$350,9,0),\"\")","v":""},{"$f":"IF(Formula!D19*(Formula!F19/100)=0,\"\",Formula!D19*(Formula!F19/100))","v":""},"",{"$f":"IFERROR(IF(VLOOKUP($A19,'DID-list 2016'!$A$7:$K$350,10,0)=\"R\",0,$I19)*OR(IF(VLOOKUP($A19,'DID-list 2016'!$A$7:$K$350,10,0)=\"NA\",0,$I19)),$I19)","v":""},{"$f":"IFERROR(IF(VLOOKUP($A19,'DID-list 2016'!$A$7:$K$350,11,0)=\"Y\",0,$I19)*OR(IF(VLOOKUP($A19,'DID-list 2016'!$A$7:$K$350,11,0)=\"NA\",0,$I19)),$I19)","v":""},"",{"$f":"IF(H19=\"\",\"\",IF(H19*Formula!O19=0,\"\",H19*Formula!O19))","v":""},{"$f":"IF(H19=\"\",\"\",IF(H19*Formula!P19=0,\"\",H19*Formula!P19))","v":""},{"$f":"IF(H19=\"\",\"\",IF(H19*Formula!Q19=0,\"\",H19*Formula!Q19))","v":""},""]
[{"$f":"IF(Formula!K20=0,\"\",Formula!K20)","v":""},{"$f":"IF(C20=\"\",\"\",IF(A20=\"\",NonDID,IFERROR(VLOOKUP(A20,'DID-list 2016'!$A$5:$K$350,2,0),Invalid)))","v":""},{"$f":"IF(Formula!C20=0,\"\",Formula!C20)","v":""},{"$f":"IF(Formula!E20=0,\"\",Formula!E20)","v":""},{"$f":"IFERROR(VLOOKUP($A20,'DID-list 2016'!$A$7:$K$350,8,0),\"\")","v":""},{"$f":"IFERROR(VLOOKUP($A20,'DID-list 2016'!$A$7:$K$350,5,0),\"\")","v":""},{"$f":"IFERROR(VLOOKUP($A20,'DID-list 2016'!$A$7:$K$350,9,0),\"\")","v":""},{"$f":"IF(Formula!D20*(Formula!F20/100)=0,\"\",Formula!D20*(Formula!F20/100))","v":""},"",{"$f":"IFERROR(IF(VLOOKUP($A20,'DID-list 2016'!$A$7:$K$350,10,0)=\"R\",0,$I20)*OR(IF(VLOOKUP($A20,'DID-list 2016'!$A$7:$K$350,10,0)=\"NA\",0,$I20)),$I20)","v":""},{"$f":"IFERROR(IF(VLOOKUP($A20,'DID-list 2016'!$A$7:$K$350,11,0)=\"Y\",0,$I20)*OR(IF(VLOOKUP($A20,'DID-list 2016'!$A$7:$K$350,11,0)=\"NA\",0,$I20)),$I20)","v":""},"",{"$f":"IF(H20=\"\",\"\",IF(H20*Formula!O20=0,\"\",H20*Formula!O20))","v":""},{"$f":"IF(H20=\"\",\"\",IF(H20*Formula!P20=0,\"\",H20*Formula!P20))","v":""},{"$f":"IF(H20=\"\",\"\",IF(H20*Formula!Q20=0,\"\",H20*Formula!Q20))","v":""},""]
[{"$f":"IF(Formula!K21=0,\"\",Formula!K21)","v":""},{"$f":"IF(C21=\"\",\"\",IF(A21=\"\",NonDID,IFERROR(VLOOKUP(A21,'DID-list 2016'!$A$5:$K$350,2,0),Invalid)))","v":""},{"$f":"IF(Formula!C21=0,\"\",Formula!C21)","v":""},{"$f":"IF(Formula!E21=0,\"\",Formula!E21)","v":""},{"$f":"IFERROR(VLOOKUP($A21,'DID-list 2016'!$A$7:$K$350,8,0),\"\")","v":""},{"$f":"IFERROR(VLOOKUP($A21,'DID-list 2016'!$A$7:$K$350,5,0),\"\")","v":""},{"$f":"IFERROR(VLOOKUP($A21,'DID-list 2016'!$A$7:$K$350,9,0),\"\")","v":""},{"$f":"IF(Formula!D21*(Formula!F21/100)=0,\"\",Formula!D21*(Formula!F21/100))","v":""},"",{"$f":"IFERROR(IF(VLOOKUP($A21,'DID-list 2016'!$A$7:$K$350,10,0)=\"R\",0,$I21)*OR(IF(VLOOKUP($A21,'DID-list 2016'!$A$7:$K$350,10,0)=\"NA\",0,$I21)),$I21)","v":""},{"$f":"IFERROR(IF(VLOOKUP($A21,'DID-list 2016'!$A$7:$K$350,11,0)=\"Y\",0,$I21)*OR(IF(VLOOKUP($A21,'DID-list 2016'!$A$7:$K$350,11,0)=\"NA\",0,$I21)),$I21)","v":""},"",{"$f":"IF(H21=\"\",\"\",IF(H21*Formula!O21=0,\"\",H21*Formula!O21))","v":""},{"$f":"IF(H21=\"\",\"\",IF(H21*Formula!P21=0,\"\",H21*Formula!P21))","v":""},{"$f":"IF(H21=\"\",\"\",IF(H21*Formula!Q21=0,\"\",H21*Formula!Q21))","v":""},""]
[{"$f":"IF(Formula!K22=0,\"\",Formula!K22)","v":""},{"$f":"IF(C22=\"\",\"\",IF(A22=\"\",NonDID,IFERROR(VLOOKUP(A22,'DID-list 2016'!$A$5:$K$350,2,0),Invalid)))","v":""},{"$f":"IF(Formula!C22=0,\"\",Formula!C22)","v":""},{"$f":"IF(Formula!E22=0,\"\",Formula!E22)","v":""},{"$f":"IFERROR(VLOOKUP($A22,'DID-list 2016'!$A$7:$K$350,8,0),\"\")","v":""},{"$f":"IFERROR(VLOOKUP($A22,'DID-list 2016'!$A$7:$K$350,5,0),\"\")","v":""},{"$f":"IFERROR(VLOOKUP($A22,'DID-list 2016'!$A$7:$K$350,9,0),\"\")","v":""},{"$f":"IF(Formula!D22*(Formula!F22/100)=0,\"\",Formula!D22*(Formula!F22/100))","v":""},"",{"$f":"IFERROR(IF(VLOOKUP($A22,'DID-list 2016'!$A$7:$K$350,10,0)=\"R\",0,$I22)*OR(IF(VLOOKUP($A22,'DID-list 2016'!$A$7:$K$350,10,0)=\"NA\",0,$I22)),$I22)","v":""},{"$f":"IFERROR(IF(VLOOKUP($A22,'DID-list 2016'!$A$7:$K$350,11,0)=\"Y\",0,$I22)*OR(IF(VLOOKUP($A22,'DID-list 2016'!$A$7:$K$350,11,0)=\"NA\",0,$I22)),$I22)","v":""},"",{"$f":"IF(H22=\"\",\"\",IF(H22*Formula!O22=0,\"\",H22*Formula!O22))","v":""},{"$f":"IF(H22=\"\",\"\",IF(H22*Formula!P22=0,\"\",H22*Formula!P22))","v":""},{"$f":"IF(H22=\"\",\"\",IF(H22*Formula!Q22=0,\"\",H22*Formula!Q22))","v":""},""]
[{"$f":"IF(Formula!K23=0,\"\",Formula!K23)","v":""},{"$f":"IF(C23=\"\",\"\",IF(A23=\"\",NonDID,IFERROR(VLOOKUP(A23,'DID-list 2016'!$A$5:$K$350,2,0),Invalid)))","v":""},{"$f":"IF(Formula!C23=0,\"\",Formula!C23)","v":""},{"$f":"IF(Formula!E23=0,\"\",Formula!E23)","v":""},{"$f":"IFERROR(VLOOKUP($A23,'DID-list 2016'!$A$7:$K$350,8,0),\"\")","v":""},{"$f":"IFERROR(VLOOKUP($A23,'DID-list 2016'!$A$7:$K$350,5,0),\"\")","v":""},{"$f":"IFERROR(VLOOKUP($A23,'DID-list 2016'!$A$7:$K$350,9,0),\"\")","v":""},{"$f":"IF(Formula!D23*(Formula!F23/100)=0,\"\",Formula!D23*(Formula!F23/100))","v":""},"",{"$f":"IFERROR(IF(VLOOKUP($A23,'DID-list 2016'!$A$7:$K$350,10,0)=\"R\",0,$I23)*OR(IF(VLOOKUP($A23,'DID-list 2016'!$A$7:$K$350,10,0)=\"NA\",0,$I23)),$I23)","v":""},{"$f":"IFERROR(IF(VLOOKUP($A23,'DID-list 2016'!$A$7:$K$350,11,0)=\"Y\",0,$I23)*OR(IF(VLOOKUP($A23,'DID-list 2016'!$A$7:$K$350,11,0)=\"NA\",0,$I23)),$I23)","v":""},"",{"$f":"IF(H23=\"\",\"\",IF(H23*Formula!O23=0,\"\",H23*Formula!O23))","v":""},{"$f":"IF(H23=\"\",\"\",IF(H23*Formula!P23=0,\"\",H23*Formula!P23))","v":""},{"$f":"IF(H23=\"\",\"\",IF(H23*Formula!Q23=0,\"\",H23*Formula!Q23))","v":""},""]
[{"$f":"IF(Formula!K24=0,\"\",Formula!K24)","v":""},{"$f":"IF(C24=\"\",\"\",IF(A24=\"\",NonDID,IFERROR(VLOOKUP(A24,'DID-list 2016'!$A$5:$K$350,2,0),Invalid)))","v":""},{"$f":"IF(Formula!C24=0,\"\",Formula!C24)","v":""},{"$f":"IF(Formula!E24=0,\"\",Formula!E24)","v":""},{"$f":"IFERROR(VLOOKUP($A24,'DID-list 2016'!$A$7:$K$350,8,0),\"\")","v":""},{"$f":"IFERROR(VLOOKUP($A24,'DID-list 2016'!$A$7:$K$350,5,0),\"\")","v":""},{"$f":"IFERROR(VLOOKUP($A24,'DID-list 2016'!$A$7:$K$350,9,0),\"\")","v":""},{"$f":"IF(Formula!D24*(Formula!F24/100)=0,\"\",Formula!D24*(Formula!F24/100))","v":""},"",{"$f":"IFERROR(IF(VLOOKUP($A24,'DID-list 2016'!$A$7:$K$350,10,0)=\"R\",0,$I24)*OR(IF(VLOOKUP($A24,'DID-list 2016'!$A$7:$K$350,10,0)=\"NA\",0,$I24)),$I24)","v":""},{"$f":"IFERROR(IF(VLOOKUP($A24,'DID-list 2016'!$A$7:$K$350,11,0)=\"Y\",0,$I24)*OR(IF(VLOOKUP($A24,'DID-list 2016'!$A$7:$K$350,11,0)=\"NA\",0,$I24)),$I24)","v":""},"",{"$f":"IF(H24=\"\",\"\",IF(H24*Formula!O24=0,\"\",H24*Formula!O24))","v":""},{"$f":"IF(H24=\"\",\"\",IF(H24*Formula!P24=0,\"\",H24*Formula!P24))","v":""},{"$f":"IF(H24=\"\",\"\",IF(H24*Formula!Q24=0,\"\",H24*Formula!Q24))","v":""},""]
[{"$f":"IF(Formula!K25=0,\"\",Formula!K25)","v":""},{"$f":"IF(C25=\"\",\"\",IF(A25=\"\",NonDID,IFERROR(VLOOKUP(A25,'DID-list 2016'!$A$5:$K$350,2,0),Invalid)))","v":""},{"$f":"IF(Formula!C25=0,\"\",Formula!C25)","v":""},{"$f":"IF(Formula!E25=0,\"\",Formula!E25)","v":""},{"$f":"IFERROR(VLOOKUP($A25,'DID-list 2016'!$A$7:$K$350,8,0),\"\")","v":""},{"$f":"IFERROR(VLOOKUP($A25,'DID-list 2016'!$A$7:$K$350,5,0),\"\")","v":""},{"$f":"IFERROR(VLOOKUP($A25,'DID-list 2016'!$A$7:$K$350,9,0),\"\")","v":""},{"$f":"IF(Formula!D25*(Formula!F25/100)=0,\"\",Formula!D25*(Formula!F25/100))","v":""},"",{"$f":"IFERROR(IF(VLOOKUP($A25,'DID-list 2016'!$A$7:$K$350,10,0)=\"R\",0,$I25)*OR(IF(VLOOKUP($A25,'DID-list 2016'!$A$7:$K$350,10,0)=\"NA\",0,$I25)),$I25)","v":""},{"$f":"IFERROR(IF(VLOOKUP($A25,'DID-list 2016'!$A$7:$K$350,11,0)=\"Y\",0,$I25)*OR(IF(VLOOKUP($A25,'DID-list 2016'!$A$7:$K$350,11,0)=\"NA\",0,$I25)),$I25)","v":""},"",{"$f":"IF(H25=\"\",\"\",IF(H25*Formula!O25=0,\"\",H25*Formula!O25))","v":""},{"$f":"IF(H25=\"\",\"\",IF(H25*Formula!P25=0,\"\",H25*Formula!P25))","v":""},{"$f":"IF(H25=\"\",\"\",IF(H25*Formula!Q25=0,\"\",H25*Formula!Q25))","v":""},""]
[{"$f":"IF(Formula!K26=0,\"\",Formula!K26)","v":""},{"$f":"IF(C26=\"\",\"\",IF(A26=\"\",NonDID,IFERROR(VLOOKUP(A26,'DID-list 2016'!$A$5:$K$350,2,0),Invalid)))","v":""},{"$f":"IF(Formula!C26=0,\"\",Formula!C26)","v":""},{"$f":"IF(Formula!E26=0,\"\",Formula!E26)","v":""},{"$f":"IFERROR(VLOOKUP($A26,'DID-list 2016'!$A$7:$K$350,8,0),\"\")","v":""},{"$f":"IFERROR(VLOOKUP($A26,'DID-list 2016'!$A$7:$K$350,5,0),\"\")","v":""},{"$f":"IFERROR(VLOOKUP($A26,'DID-list 2016'!$A$7:$K$350,9,0),\"\")","v":""},{"$f":"IF(Formula!D26*(Formula!F26/100)=0,\"\",Formula!D26*(Formula!F26/100))","v":""},"",{"$f":"IFERROR(IF(VLOOKUP($A26,'DID-list 2016'!$A$7:$K$350,10,0)=\"R\",0,$I26)*OR(IF(VLOOKUP($A26,'DID-list 2016'!$A$7:$K$350,10,0)=\"NA\",0,$I26)),$I26)","v":""},{"$f":"IFERROR(IF(VLOOKUP($A26,'DID-list 2016'!$A$7:$K$350,11,0)=\"Y\",0,$I26)*OR(IF(VLOOKUP($A26,'DID-list 2016'!$A$7:$K$350,11,0)=\"NA\",0,$I26)),$I26)","v":""},"",{"$f":"IF(H26=\"\",\"\",IF(H26*Formula!O26=0,\"\",H26*Formula!O26))","v":""},{"$f":"IF(H26=\"\",\"\",IF(H26*Formula!P26=0,\"\",H26*Formula!P26))","v":""},{"$f":"IF(H26=\"\",\"\",IF(H26*Formula!Q26=0,\"\",H26*Formula!Q26))","v":""},""]
[{"$f":"IF(Formula!K27=0,\"\",Formula!K27)","v":""},{"$f":"IF(C27=\"\",\"\",IF(A27=\"\",NonDID,IFERROR(VLOOKUP(A27,'DID-list 2016'!$A$5:$K$350,2,0),Invalid)))","v":""},{"$f":"IF(Formula!C27=0,\"\",Formula!C27)","v":""},{"$f":"IF(Formula!E27=0,\"\",Formula!E27)","v":""},{"$f":"IFERROR(VLOOKUP($A27,'DID-list 2016'!$A$7:$K$350,8,0),\"\")","v":""},{"$f":"IFERROR(VLOOKUP($A27,'DID-list 2016'!$A$7:$K$350,5,0),\"\")","v":""},{"$f":"IFERROR(VLOOKUP($A27,'DID-list 2016'!$A$7:$K$350,9,0),\"\")","v":""},{"$f":"IF(Formula!D27*(Formula!F27/100)=0,\"\",Formula!D27*(Formula!F27/100))","v":""},"",{"$f":"IFERROR(IF(VLOOKUP($A27,'DID-list 2016'!$A$7:$K$350,10,0)=\"R\",0,$I27)*OR(IF(VLOOKUP($A27,'DID-list 2016'!$A$7:$K$350,10,0)=\"NA\",0,$I27)),$I27)","v":""},{"$f":"IFERROR(IF(VLOOKUP($A27,'DID-list 2016'!$A$7:$K$350,11,0)=\"Y\",0,$I27)*OR(IF(VLOOKUP($A27,'DID-list 2016'!$A$7:$K$350,11,0)=\"NA\",0,$I27)),$I27)","v":""},"",{"$f":"IF(H27=\"\",\"\",IF(H27*Formula!O27=0,\"\",H27*Formula!O27))","v":""},{"$f":"IF(H27=\"\",\"\",IF(H27*Formula!P27=0,\"\",H27*Formula!P27))","v":""},{"$f":"IF(H27=\"\",\"\",IF(H27*Formula!Q27=0,\"\",H27*Formula!Q27))","v":""},""]
[{"$f":"IF(Formula!K28=0,\"\",Formula!K28)","v":""},{"$f":"IF(C28=\"\",\"\",IF(A28=\"\",NonDID,IFERROR(VLOOKUP(A28,'DID-list 2016'!$A$5:$K$350,2,0),Invalid)))","v":""},{"$f":"IF(Formula!C28=0,\"\",Formula!C28)","v":""},{"$f":"IF(Formula!E28=0,\"\",Formula!E28)","v":""},{"$f":"IFERROR(VLOOKUP($A28,'DID-list 2016'!$A$7:$K$350,8,0),\"\")","v":""},{"$f":"IFERROR(VLOOKUP($A28,'DID-list 2016'!$A$7:$K$350,5,0),\"\")","v":""},{"$f":"IFERROR(VLOOKUP($A28,'DID-list 2016'!$A$7:$K$350,9,0),\"\")","v":""},{"$f":"IF(Formula!D28*(Formula!F28/100)=0,\"\",Formula!D28*(Formula!F28/100))","v":""},"",{"$f":"IFERROR(IF(VLOOKUP($A28,'DID-list 2016'!$A$7:$K$350,10,0)=\"R\",0,$I28)*OR(IF(VLOOKUP($A28,'DID-list 2016'!$A$7:$K$350,10,0)=\"NA\",0,$I28)),$I28)","v":""},{"$f":"IFERROR(IF(VLOOKUP($A28,'DID-list 2016'!$A$7:$K$350,11,0)=\"Y\",0,$I28)*OR(IF(VLOOKUP($A28,'DID-list 2016'!$A$7:$K$350,11,0)=\"NA\",0,$I28)),$I28)","v":""},"",{"$f":"IF(H28=\"\",\"\",IF(H28*Formula!O28=0,\"\",H28*Formula!O28))","v":""},{"$f":"IF(H28=\"\",\"\",IF(H28*Formula!P28=0,\"\",H28*Formula!P28))","v":""},{"$f":"IF(H28=\"\",\"\",IF(H28*Formula!Q28=0,\"\",H28*Formula!Q28))","v":""},""]
[{"$f":"IF(Formula!K29=0,\"\",Formula!K29)","v":""},{"$f":"IF(C29=\"\",\"\",IF(A29=\"\",NonDID,IFERROR(VLOOKUP(A29,'DID-list 2016'!$A$5:$K$350,2,0),Invalid)))","v":""},{"$f":"IF(Formula!C29=0,\"\",Formula!C29)","v":""},{"$f":"IF(Formula!E29=0,\"\",Formula!E29)","v":""},{"$f":"IFERROR(VLOOKUP($A29,'DID-list 2016'!$A$7:$K$350,8,0),\"\")","v":""},{"$f":"IFERROR(VLOOKUP($A29,'DID-list 2016'!$A$7:$K$350,5,0),\"\")","v":""},{"$f":"IFERROR(VLOOKUP($A29,'DID-list 2016'!$A$7:$K$350,9,0),\"\")","v":""},{"$f":"IF(Formula!D29*(Formula!F29/100)=0,\"\",Formula!D29*(Formula!F29/100))","v":""},"",{"$f":"IFERROR(IF(VLOOKUP($A29,'DID-list 2016'!$A$7:$K$350,10,0)=\"R\",0,$I29)*OR(IF(VLOOKUP($A29,'DID-list 2016'!$A$7:$K$350,10,0)=\"NA\",0,$I29)),$I29)","v":""},{"$f":"IFERROR(IF(VLOOKUP($A29,'DID-list 2016'!$A$7:$K$350,11,0)=\"Y\",0,$I29)*OR(IF(VLOOKUP($A29,'DID-list 2016'!$A$7:$K$350,11,0)=\"NA\",0,$I29)),$I29)","v":""},"",{"$f":"IF(H29=\"\",\"\",IF(H29*Formula!O29=0,\"\",H29*Formula!O29))","v":""},{"$f":"IF(H29=\"\",\"\",IF(H29*Formula!P29=0,\"\",H29*Formula!P29))","v":""},{"$f":"IF(H29=\"\",\"\",IF(H29*Formula!Q29=0,\"\",H29*Formula!Q29))","v":""},""]
[{"$f":"IF(Formula!K30=0,\"\",Formula!K30)","v":""},{"$f":"IF(C30=\"\",\"\",IF(A30=\"\",NonDID,IFERROR(VLOOKUP(A30,'DID-list 2016'!$A$5:$K$350,2,0),Invalid)))","v":""},{"$f":"IF(Formula!C30=0,\"\",Formula!C30)","v":""},{"$f":"IF(Formula!E30=0,\"\",Formula!E30)","v":""},{"$f":"IFERROR(VLOOKUP($A30,'DID-list 2016'!$A$7:$K$350,8,0),\"\")","v":""},{"$f":"IFERROR(VLOOKUP($A30,'DID-list 2016'!$A$7:$K$350,5,0),\"\")","v":""},{"$f":"IFERROR(VLOOKUP($A30,'DID-list 2016'!$A$7:$K$350,9,0),\"\")","v":""},{"$f":"IF(Formula!D30*(Formula!F30/100)=0,\"\",Formula!D30*(Formula!F30/100))","v":""},"",{"$f":"IFERROR(IF(VLOOKUP($A30,'DID-list 2016'!$A$7:$K$350,10,0)=\"R\",0,$I30)*OR(IF(VLOOKUP($A30,'DID-list 2016'!$A$7:$K$350,10,0)=\"NA\",0,$I30)),$I30)","v":""},{"$f":"IFERROR(IF(VLOOKUP($A30,'DID-list 2016'!$A$7:$K$350,11,0)=\"Y\",0,$I30)*OR(IF(VLOOKUP($A30,'DID-list 2016'!$A$7:$K$350,11,0)=\"NA\",0,$I30)),$I30)","v":""},"",{"$f":"IF(H30=\"\",\"\",IF(H30*Formula!O30=0,\"\",H30*Formula!O30))","v":""},{"$f":"IF(H30=\"\",\"\",IF(H30*Formula!P30=0,\"\",H30*Formula!P30))","v":""},{"$f":"IF(H30=\"\",\"\",IF(H30*Formula!Q30=0,\"\",H30*Formula!Q30))","v":""},""]
[{"$f":"IF(Formula!K31=0,\"\",Formula!K31)","v":""},{"$f":"IF(C31=\"\",\"\",IF(A31=\"\",NonDID,IFERROR(VLOOKUP(A31,'DID-list 2016'!$A$5:$K$350,2,0),Invalid)))","v":""},{"$f":"IF(Formula!C31=0,\"\",Formula!C31)","v":""},{"$f":"IF(Formula!E31=0,\"\",Formula!E31)","v":""},{"$f":"IFERROR(VLOOKUP($A31,'DID-list 2016'!$A$7:$K$350,8,0),\"\")","v":""},{"$f":"IFERROR(VLOOKUP($A31,'DID-list 2016'!$A$7:$K$350,5,0),\"\")","v":""},{"$f":"IFERROR(VLOOKUP($A31,'DID-list 2016'!$A$7:$K$350,9,0),\"\")","v":""},{"$f":"IF(Formula!D31*(Formula!F31/100)=0,\"\",Formula!D31*(Formula!F31/100))","v":""},"",{"$f":"IFERROR(IF(VLOOKUP($A31,'DID-list 2016'!$A$7:$K$350,10,0)=\"R\",0,$I31)*OR(IF(VLOOKUP($A31,'DID-list 2016'!$A$7:$K$350,10,0)=\"NA\",0,$I31)),$I31)","v":""},{"$f":"IFERROR(IF(VLOOKUP($A31,'DID-list 2016'!$A$7:$K$350,11,0)=\"Y\",0,$I31)*OR(IF(VLOOKUP($A31,'DID-list 2016'!$A$7:$K$350,11,0)=\"NA\",0,$I31)),$I31)","v":""},"",{"$f":"IF(H31=\"\",\"\",IF(H31*Formula!O31=0,\"\",H31*Formula!O31))","v":""},{"$f":"IF(H31=\"\",\"\",IF(H31*Formula!P31=0,\"\",H31*Formula!P31))","v":""},{"$f":"IF(H31=\"\",\"\",IF(H31*Formula!Q31=0,\"\",H31*Formula!Q31))","v":""},""]
[{"$f":"IF(Formula!K32=0,\"\",Formula!K32)","v":""},{"$f":"IF(C32=\"\",\"\",IF(A32=\"\",NonDID,IFERROR(VLOOKUP(A32,'DID-list 2016'!$A$5:$K$350,2,0),Invalid)))","v":""},{"$f":"IF(Formula!C32=0,\"\",Formula!C32)","v":""},{"$f":"IF(Formula!E32=0,\"\",Formula!E32)","v":""},{"$f":"IFERROR(VLOOKUP($A32,'DID-list 2016'!$A$7:$K$350,8,0),\"\")","v":""},{"$f":"IFERROR(VLOOKUP($A32,'DID-list 2016'!$A$7:$K$350,5,0),\"\")","v":""},{"$f":"IFERROR(VLOOKUP($A32,'DID-list 2016'!$A$7:$K$350,9,0),\"\")","v":""},{"$f":"IF(Formula!D32*(Formula!F32/100)=0,\"\",Formula!D32*(Formula!F32/100))","v":""},"",{"$f":"IFERROR(IF(VLOOKUP($A32,'DID-list 2016'!$A$7:$K$350,10,0)=\"R\",0,$I32)*OR(IF(VLOOKUP($A32,'DID-list 2016'!$A$7:$K$350,10,0)=\"NA\",0,$I32)),$I32)","v":""},{"$f":"IFERROR(IF(VLOOKUP($A32,'DID-list 2016'!$A$7:$K$350,11,0)=\"Y\",0,$I32)*OR(IF(VLOOKUP($A32,'DID-list 2016'!$A$7:$K$350,11,0)=\"NA\",0,$I32)),$I32)","v":""},"",{"$f":"IF(H32=\"\",\"\",IF(H32*Formula!O32=0,\"\",H32*Formula!O32))","v":""},{"$f":"IF(H32=\"\",\"\",IF(H32*Formula!P32=0,\"\",H32*Formula!P32))","v":""},{"$f":"IF(H32=\"\",\"\",IF(H32*Formula!Q32=0,\"\",H32*Formula!Q32))","v":""},""]
[{"$f":"IF(Formula!K33=0,\"\",Formula!K33)","v":""},{"$f":"IF(C33=\"\",\"\",IF(A33=\"\",NonDID,IFERROR(VLOOKUP(A33,'DID-list 2016'!$A$5:$K$350,2,0),Invalid)))","v":""},{"$f":"IF(Formula!C33=0,\"\",Formula!C33)","v":""},{"$f":"IF(Formula!E33=0,\"\",Formula!E33)","v":""},{"$f":"IFERROR(VLOOKUP($A33,'DID-list 2016'!$A$7:$K$350,8,0),\"\")","v":""},{"$f":"IFERROR(VLOOKUP($A33,'DID-list 2016'!$A$7:$K$350,5,0),\"\")","v":""},{"$f":"IFERROR(VLOOKUP($A33,'DID-list 2016'!$A$7:$K$350,9,0),\"\")","v":""},{"$f":"IF(Formula!D33*(Formula!F33/100)=0,\"\",Formula!D33*(Formula!F33/100))","v":""},"",{"$f":"IFERROR(IF(VLOOKUP($A33,'DID-list 2016'!$A$7:$K$350,10,0)=\"R\",0,$I33)*OR(IF(VLOOKUP($A33,'DID-list 2016'!$A$7:$K$350,10,0)=\"NA\",0,$I33)),$I33)","v":""},{"$f":"IFERROR(IF(VLOOKUP($A33,'DID-list 2016'!$A$7:$K$350,11,0)=\"Y\",0,$I33)*OR(IF(VLOOKUP($A33,'DID-list 2016'!$A$7:$K$350,11,0)=\"NA\",0,$I33)),$I33)","v":""},"",{"$f":"IF(H33=\"\",\"\",IF(H33*Formula!O33=0,\"\",H33*Formula!O33))","v":""},{"$f":"IF(H33=\"\",\"\",IF(H33*Formula!P33=0,\"\",H33*Formula!P33))","v":""},{"$f":"IF(H33=\"\",\"\",IF(H33*Formula!Q33=0,\"\",H33*Formula!Q33))","v":""},""]
[{"$f":"IF(Formula!K34=0,\"\",Formula!K34)","v":""},{"$f":"IF(C34=\"\",\"\",IF(A34=\"\",NonDID,IFERROR(VLOOKUP(A34,'DID-list 2016'!$A$5:$K$350,2,0),Invalid)))","v":""},{"$f":"IF(Formula!C34=0,\"\",Formula!C34)","v":""},{"$f":"IF(Formula!E34=0,\"\",Formula!E34)","v":""},{"$f":"IFERROR(VLOOKUP($A34,'DID-list 2016'!$A$7:$K$350,8,0),\"\")","v":""},{"$f":"IFERROR(VLOOKUP($A34,'DID-list 2016'!$A$7:$K$350,5,0),\"\")","v":""},{"$f":"IFERROR(VLOOKUP($A34,'DID-list 2016'!$A$7:$K$350,9,0),\"\")","v":""},{"$f":"IF(Formula!D34*(Formula!F34/100)=0,\"\",Formula!D34*(Formula!F34/100))","v":""},"",{"$f":"IFERROR(IF(VLOOKUP($A34,'DID-list 2016'!$A$7:$K$350,10,0)=\"R\",0,$I34)*OR(IF(VLOOKUP($A34,'DID-list 2016'!$A$7:$K$350,10,0)=\"NA\",0,$I34)),$I34)","v":""},{"$f":"IFERROR(IF(VLOOKUP($A34,'DID-list 2016'!$A$7:$K$350,11,0)=\"Y\",0,$I34)*OR(IF(VLOOKUP($A34,'DID-list 2016'!$A$7:$K$350,11,0)=\"NA\",0,$I34)),$I34)","v":""},"",{"$f":"IF(H34=\"\",\"\",IF(H34*Formula!O34=0,\"\",H34*Formula!O34))","v":""},{"$f":"IF(H34=\"\",\"\",IF(H34*Formula!P34=0,\"\",H34*Formula!P34))","v":""},{"$f":"IF(H34=\"\",\"\",IF(H34*Formula!Q34=0,\"\",H34*Formula!Q34))","v":""},""]
[{"$f":"IF(Formula!K35=0,\"\",Formula!K35)","v":""},{"$f":"IF(C35=\"\",\"\",IF(A35=\"\",NonDID,IFERROR(VLOOKUP(A35,'DID-list 2016'!$A$5:$K$350,2,0),Invalid)))","v":""},{"$f":"IF(Formula!C35=0,\"\",Formula!C35)","v":""},{"$f":"IF(Formula!E35=0,\"\",Formula!E35)","v":""},{"$f":"IFERROR(VLOOKUP($A35,'DID-list 2016'!$A$7:$K$350,8,0),\"\")","v":""},{"$f":"IFERROR(VLOOKUP($A35,'DID-list 2016'!$A$7:$K$350,5,0),\"\")","v":""},{"$f":"IFERROR(VLOOKUP($A35,'DID-list 2016'!$A$7:$K$350,9,0),\"\")","v":""},{"$f":"IF(Formula!D35*(Formula!F35/100)=0,\"\",Formula!D35*(Formula!F35/100))","v":""},"",{"$f":"IFERROR(IF(VLOOKUP($A35,'DID-list 2016'!$A$7:$K$350,10,0)=\"R\",0,$I35)*OR(IF(VLOOKUP($A35,'DID-list 2016'!$A$7:$K$350,10,0)=\"NA\",0,$I35)),$I35)","v":""},{"$f":"IFERROR(IF(VLOOKUP($A35,'DID-list 2016'!$A$7:$K$350,11,0)=\"Y\",0,$I35)*OR(IF(VLOOKUP($A35,'DID-list 2016'!$A$7:$K$350,11,0)=\"NA\",0,$I35)),$I35)","v":""},"",{"$f":"IF(H35=\"\",\"\",IF(H35*Formula!O35=0,\"\",H35*Formula!O35))","v":""},{"$f":"IF(H35=\"\",\"\",IF(H35*Formula!P35=0,\"\",H35*Formula!P35))","v":""},{"$f":"IF(H35=\"\",\"\",IF(H35*Formula!Q35=0,\"\",H35*Formula!Q35))","v":""},""]
[{"$f":"IF(Formula!K36=0,\"\",Formula!K36)","v":""},{"$f":"IF(C36=\"\",\"\",IF(A36=\"\",NonDID,IFERROR(VLOOKUP(A36,'DID-list 2016'!$A$5:$K$350,2,0),Invalid)))","v":""},{"$f":"IF(Formula!C36=0,\"\",Formula!C36)","v":""},{"$f":"IF(Formula!E36=0,\"\",Formula!E36)","v":""},{"$f":"IFERROR(VLOOKUP($A36,'DID-list 2016'!$A$7:$K$350,8,0),\"\")","v":""},{"$f":"IFERROR(VLOOKUP($A36,'DID-list 2016'!$A$7:$K$350,5,0),\"\")","v":""},{"$f":"IFERROR(VLOOKUP($A36,'DID-list 2016'!$A$7:$K$350,9,0),\"\")","v":""},{"$f":"IF(Formula!D36*(Formula!F36/100)=0,\"\",Formula!D36*(Formula!F36/100))","v":""},"",{"$f":"IFERROR(IF(VLOOKUP($A36,'DID-list 2016'!$A$7:$K$350,10,0)=\"R\",0,$I36)*OR(IF(VLOOKUP($A36,'DID-list 2016'!$A$7:$K$350,10,0)=\"NA\",0,$I36)),$I36)","v":""},{"$f":"IFERROR(IF(VLOOKUP($A36,'DID-list 2016'!$A$7:$K$350,11,0)=\"Y\",0,$I36)*OR(IF(VLOOKUP($A36,'DID-list 2016'!$A$7:$K$350,11,0)=\"NA\",0,$I36)),$I36)","v":""},"",{"$f":"IF(H36=\"\",\"\",IF(H36*Formula!O36=0,\"\",H36*Formula!O36))","v":""},{"$f":"IF(H36=\"\",\"\",IF(H36*Formula!P36=0,\"\",H36*Formula!P36))","v":""},{"$f":"IF(H36=\"\",\"\",IF(H36*Formula!Q36=0,\"\",H36*Formula!Q36))","v":""},""]
[null,"SUM",{"$nulls":5},{"$f":"SUM(H6:H36)","v":{"v":0,"d":"0.000"}},{"$f":"SUM(I6:I35)","v":{"v":0,"d":"0.000"}},{"v":0,"d":"0.000"},{"v":0,"d":"0.000"},{"v":0,"d":"0.000"},{"v":0,"d":"0.000"},{"v":0,"d":"0.000"},{"v":0,"d":"0.000"},{"v":0,"d":"0.000"}]
[]
[]
[{"$nulls":8},"Requirements",null,null,{"$f":"L50","v":"R17"},null,"R19",{"$f":"O50","v":"R18"},{"$f":"P50","v":"R18"}]
[null,"For chemicals not on the DID-list and explanation for columns",{"$nulls":6},"Product type",null,null,{"$f":"L51","v":"∑ (H410)*100 + H411*10 + H412) (%)"},null,{"$f":"N51","v":"CDV-limit (chron)"},{"$f":"O51","v":"aNBO"},{"$f":"P51","v":"anNBO"}]
[null,"D & E  Lowest toxicity value / safety factor *",{"$nulls":6},"Foam soap",null,null,{"$f":"IF(P37<=L52+0.045,\"OK\",\"NO\")","v":"OK"},null,{"$f":"IFERROR(IF($L$37<=N52+0.45,\"OK\",\"NO\"),\"\")","v":"OK"},{"$f":"IFERROR(IF($J$37<=O52+0.045,\"OK\",\"NO\"),\"\")","v":"OK"},{"$f":"IFERROR(IF($K$37<=P52+0.045,\"OK\",\"NO\"),\"\")","v":"OK"}]
[null,"F  Degradability ** "]
[null,"I   Amount not aerobic biodegradable organic substance per functional unit (solution). If ingredient is not on DID-list; if ingredient is aerobic biodegradable fill in \"0\", if ingredient is not aerobic biodegradable copy amount from column (H)."]
[]
[null,"J  Amount not anaerobic biodegradable organic substance per functional unit (solution). If ingredient is not on DID-list; if ingredient is anaerobic biodegradable fill in \"0\", if ingredient is not anaerobic bio     degradable copy amount from column (H)."]
[]
[null,"* Lowest toxicity value (in all tested groups) / Safety factor 1000, 5000, 10000 for 3, 2, 1 tested organism groups."]
[null,"** Factor is 0,05 - 0,5 - 1 for readily biodegradable - inherently biodegradable - persistent (can be 0,15 for some surfactants)."]
[{"$nulls":8},"Limits",null,null,"R17",null,"R19","R18","R18"]
[null,"Exemptions",{"$nulls":6},"Product type",null,null,"∑ (H410)*100 + H411*10 + H412) (%)",null,"CDV-limit (chron)","aNBO","anNBO"]
[null,"Note that the following exceptions\n apply:",{"$nulls":6},"Foam soap",null,null,2.5,null,1000,2.5,2.5]
[null,"* Cumensulphonate (DID# 2540) – the data on the DID list does not agree with that published under the HERA project. \nThe following data on cumen-sulphonates can be used for application: aNBO = R and DF = 0.05. Since BCF = 1.41 and logKow = -2.7, cumensulphonates can in accordance with Appendix 2 be exempted from the calculation of anNBO."]

{"sheet":"CDV & Degradability 2023","index":3,"n_rows":53,"n_cols":16,"rows_kept":53,"merged":[[0,0,0,8],[2,4,2,5],[39,11,39,12],[40,11,40,12],[41,11,41,12],[42,8,42,9],[43,1,44,7],[43,8,43,9],[44,8,44,9],[45,1,46,7],[45,8,45,9],[46,8,46,9],[47,8,47,9],[49,11,49,12],[50,11,50,12],[51,8,51,10],[51,11,51,12],[52,1,54,7],[52,8,52,9],[53,8,53,9],[54,8,54,9],[55,8,55,9],[56,8,56,9]]}
["If the ingredient does not have a DID2023-number, also fill in column E, F, G, J and K"]
[]
[null,"Name of product:",null,{"$f":"IF(Formula!B1=0,\"\",Formula!B1)","v":""},"Standard dose in grams:",null,{"$f":"IF(Formula!B4=\"\",\"\",Formula!B4)","v":""}]
[null,"Type of product: ",null,{"$f":"IF(Formula!B2=0,\"\",Formula!B2)","v":""}]
["DID-no.","DID-no. Ingredient name","Raw material trade name","Chemical name (given in formula)","TF(chron)","TF(acute)","DF","Active content (%)","mg/dose","aNBO mg/dose"," anNBO mg/dose","CDV(chron) (l/dose)","∑ H410","∑ H411","∑ H412","∑ (H410*100 + H411*10 + H412)"]
[{"$f":"IF(Formula!L6=0,\"\",Formula!L6)","v":""},{"$f":"IF(C6=\"\",\"\",IF(A6=\"\",NonDID,IFERROR(VLOOKUP(A6,'DID-list 2023'!$A$5:$K$350,2,0),Invalid)))","v":""},{"$f":"IF(Formula!C6=0,\"\",Formula!C6)","v":""},{"$f":"IF(Formula!E6=0,\"\",Formula!E6)","v":""},{"$f":"IFERROR(VLOOKUP($A6,'DID-list 2023'!$A$7:$K$350,8,0),\"\")","v":""},{"$f":"IFERROR(VLOOKUP($A6,'DID-list 2023'!$A$7:$K$350,5,0),\"\")","v":""},{"$f":"IFERROR(VLOOKUP($A6,'DID-list 2023'!$A$7:$K$350,9,0),\"\")","v":""},{"$f":"IF(Formula!D6*(Formula!F6/100)=0,\"\",Formula!D6*(Formula!F6/100))","v":""},{"$f":"IF(H6=\"\",\"\",($H6/100*1000)*$G$3)","v":""},{"$f":"IFERROR(IF(VLOOKUP($A6,'DID-list 2023'!$A$7:$K$350,10,0)=\"R\",0,$I6)*OR(IF(VLOOKUP($A6,'DID-list 2023'!$A$7:$K$350,10,0)=\"NA\",0,$I6)),$I6)","v":""},{"$f":"IFERROR(IF(VLOOKUP($A6,'DID-list 2023'!$A$7:$K$350,11,0)=\"Y\",0,$I6)*OR(IF(VLOOKUP($A6,'DID-list 2023'!$A$7:$K$350,11,0)=\"NA\",0,$I6)),$I6)","v":""},{"$f":"IFERROR($I6*$G6/$E6,\"\")","v":""},{"$f":"IF(H6=\"\",\"\",IF(H6*Formula!O6=0,\"\",H6*Formula!O6))","v":""},{"$f":"IF(H6=\"\",\"\",IF(H6*Formula!P6=0,\"\",H6*Formula!P6))","v":""},{"$f":"IF(H6=\"\",\"\",IF(H6*Formula!Q6=0,\"\",H6*Formula!Q6))","v":""},{"$f":"IF(100*IF(M6=\"\",0,M6)+10*IF(N6=\"\",0,N6)+IF(O6=\"\",0,O6)=0,\"\",(100*IF(M6=\"\",0,M6)+10*IF(N6=\"\",0,N6)+IF(O6=\"\",0,O6)))","v":""}]
[{"$f":"IF(Formula!L7=0,\"\",Formula!L7)","v":""},{"$f":"IF(C7=\"\",\"\",IF(A7=\"\",NonDID,IFERROR(VLOOKUP(A7,'DID-list 2023'!$A$5:$K$350,2,0),Invalid)))","v":""},{"$f":"IF(Formula!C7=0,\"\",Formula!C7)","v":""},{"$f":"IF(Formula!E7=0,\"\",Formula!E7)","v":""},{"$f":"IFERROR(VLOOKUP($A7,'DID-list 2023'!$A$7:$K$350,8,0),\"\")","v":""},{"$f":"IFERROR(VLOOKUP($A7,'DID-list 2023'!$A$7:$K$350,5,0),\"\")","v":""},{"$f":"IFERROR(VLOOKUP($A7,'DID-list 2023'!$A$7:$K$350,9,0),\"\")","v":""},{"$f":"IF(Formula!D7*(Formula!F7/100)=0,\"\",Formula!D7*(Formula!F7/100))","v":""},"",{"$f":"IFERROR(IF(VLOOKUP($A7,'DID-list 2023'!$A$7:$K$350,10,0)=\"R\",0,$I7)*OR(IF(VLOOKUP($A7,'DID-list 2023'!$A$7:$K$350,10,0)=\"NA\",0,$I7)),$I7)","v":""},{"$f":"IFERROR(IF(VLOOKUP($A7,'DID-list 2023'!$A$7:$K$350,11,0)=\"Y\",0,$I7)*OR(IF(VLOOKUP($A7,'DID-list 2023'!$A$7:$K$350,11,0)=\"NA\",0,$I7)),$I7)","v":""},"",{"$f":"IF(H7=\"\",\"\",IF(H7*Formula!O7=0,\"\",H7*Formula!O7))","v":""},{"$f":"IF(H7=\"\",\"\",IF(H7*Formula!P7=0,\"\",H7*Formula!P7))","v":""},{"$f":"IF(H7=\"\",\"\",IF(H7*Formula!Q7=0,\"\",H7*Formula!Q7))","v":""},{"$f":"IF(100*IF(M7=\"\",0,M7)+10*IF(N7=\"\",0,N7)+IF(O7=\"\",0,O7)=0,\"\",(100*IF(M7=\"\",0,M7)+10*IF(N7=\"\",0,N7)+IF(O7=\"\",0,O7)))","v":""}]
[{"$f":"IF(Formula!L8=0,\"\",Formula!L8)","v":""},{"$f":"IF(C8=\"\",\"\",IF(A8=\"\",NonDID,IFERROR(VLOOKUP(A8,'DID-list 2023'!$A$5:$K$350,2,0),Invalid)))","v":""},{"$f":"IF(Formula!C8=0,\"\",Formula!C8)","v":""},{"$f":"IF(Formula!E8=0,\"\",Formula!E8)","v":""},{"$f":"IFERROR(VLOOKUP($A8,'DID-list 2023'!$A$7:$K$350,8,0),\"\")","v":""},{"$f":"IFERROR(VLOOKUP($A8,'DID-list 2023'!$A$7:$K$350,5,0),\"\")","v":""},{"$f":"IFERROR(VLOOKUP($A8,'DID-list 2023'!$A$7:$K$350,9,0),\"\")","v":""},{"$f":"IF(Formula!D8*(Formula!F8/100)=0,\"\",Formula!D8*(Formula!F8/100))","v":""},"",{"$f":"IFERROR(IF(VLOOKUP($A8,'DID-list 2023'!$A$7:$K$350,10,0)=\"R\",0,$I8)*OR(IF(VLOOKUP($A8,'DID-list 2023'!$A$7:$K$350,10,0)=\"NA\",0,$I8)),$I8)","v":""},{"$f":"IFERROR(IF(VLOOKUP($A8,'DID-list 2023'!$A$7:$K$350,11,0)=\"Y\",0,$I8)*OR(IF(VLOOKUP($A8,'DID-list 2023'!$A$7:$K$350,11,0)=\"NA\",0,$I8)),$I8)","v":""},"",{"$f":"IF(H8=\"\",\"\",IF(H8*Formula!O8=0,\"\",H8*Formula!O8))","v":""},{"$f":"IF(H8=\"\",\"\",IF(H8*Formula!P8=0,\"\",H8*Formula!P8))","v":""},{"$f":"IF(H8=\"\",\"\",IF(H8*Formula!Q8=0,\"\",H8*Formula!Q8))","v":""},""]
[{"$f":"IF(Formula!L9=0,\"\",Formula!L9)","v":""},{"$f":"IF(C9=\"\",\"\",IF(A9=\"\",NonDID,IFERROR(VLOOKUP(A9,'DID-list 2023'!$A$5:$K$350,2,0),Invalid)))","v":""},{"$f":"IF(Formula!C9=0,\"\",Formula!C9)","v":""},{"$f":"IF(Formula!E9=0,\"\",Formula!E9)","v":""},{"$f":"IFERROR(VLOOKUP($A9,'DID-list 2023'!$A$7:$K$350,8,0),\"\")","v":""},{"$f":"IFERROR(VLOOKUP($A9,'DID-list 2023'!$A$7:$K$350,5,0),\"\")","v":""},{"$f":"IFERROR(VLOOKUP($A9,'DID-list 2023'!$A$7:$K$350,9,0),\"\")","v":""},{"$f":"IF(Formula!D9*(Formula!F9/100)=0,\"\",Formula!D9*(Formula!F9/100))","v":""},"",{"$f":"IFERROR(IF(VLOOKUP($A9,'DID-list 2023'!$A$7:$K$350,10,0)=\"R\",0,$I9)*OR(IF(VLOOKUP($A9,'DID-list 2023'!$A$7:$K$350,10,0)=\"NA\",0,$I9)),$I9)","v":""},{"$f":"IFERROR(IF(VLOOKUP($A9,'DID-list 2023'!$A$7:$K$350,11,0)=\"Y\",0,$I9)*OR(IF(VLOOKUP($A9,'DID-list 2023'!$A$7:$K$350,11,0)=\"NA\",0,$I9)),$I9)","v":""},"",{"$f":"IF(H9=\"\",\"\",IF(H9*Formula!O9=0,\"\",H9*Formula!O9))","v":""},{"$f":"IF(H9=\"\",\"\",IF(H9*Formula!P9=0,\"\",H9*Formula!P9))","v":""},{"$f":"IF(H9=\"\",\"\",IF(H9*Formula!Q9=0,\"\",H9*Formula!Q9))","v":""},""]
[{"$f":"IF(Formula!L10=0,\"\",Formula!L10)","v":""},{"$f":"IF(C10=\"\",\"\",IF(A10=\"\",NonDID,IFERROR(VLOOKUP(A10,'DID-list 2023'!$A$5:$K$350,2,0),Invalid)))","v":""},{"$f":"IF(Formula!C10=0,\"\",Formula!C10)","v":""},{"$f":"IF(Formula!E10=0,\"\",Formula!E10)","v":""},{"$f":"IFERROR(VLOOKUP($A10,'DID-list 2023'!$A$7:$K$350,8,0),\"\")","v":""},{"$f":"IFERROR(VLOOKUP($A10,'DID-list 2023'!$A$7:$K$350,5,0),\"\")","v":""},{"$f":"IFERROR(VLOOKUP($A10,'DID-list 2023'!$A$7:$K$350,9,0),\"\")","v":""},{"$f":"IF(Formula!D10*(Formula!F10/100)=0,\"\",Formula!D10*(Formula!F10/100))","v":""},"",{"$f":"IFERROR(IF(VLOOKUP($A10,'DID-list 2023'!$A$7:$K$350,10,0)=\"R\",0,$I10)*OR(IF(VLOOKUP($A10,'DID-list 2023'!$A$7:$K$350,10,0)=\"NA\",0,$I10)),$I10)","v":""},{"$f":"IFERROR(IF(VLOOKUP($A10,'DID-list 2023'!$A$7:$K$350,11,0)=\"Y\",0,$I10)*OR(IF(VLOOKUP($A10,'DID-list 2023'!$A$7:$K$350,11,0)=\"NA\",0,$I10)),$I10)","v":""},"",{"$f":"IF(H10=\"\",\"\",IF(H10*Formula!O10=0,\"\",H10*Formula!O10))","v":""},{"$f":"IF(H10=\"\",\"\",IF(H10*Formula!P10=0,\"\",H10*Formula!P10))","v":""},{"$f":"IF(H10=\"\",\"\",IF(H10*Formula!Q10=0,\"\",H10*Formula!Q10))","v":""},""]
[{"$f":"IF(Formula!L11=0,\"\",Formula!L11)","v":""},{"$f":"IF(C11=\"\",\"\",IF(A11=\"\",NonDID,IFERROR(VLOOKUP(A11,'DID-list 2023'!$A$5:$K$350,2,0),Invalid)))","v":""},{"$f":"IF(Formula!C11=0,\"\",Formula!C11)","v":""},{"$f":"IF(Formula!E11=0,\"\",Formula!E11)","v":""},{"$f":"IFERROR(VLOOKUP($A11,'DID-list 2023'!$A$7:$K$350,8,0),\"\")","v":""},{"$f":"IFERROR(VLOOKUP($A11,'DID-list 2023'!$A$7:$K$350,5,0),\"\")","v":""},{"$f":"IFERROR(VLOOKUP($A11,'DID-list 2023'!$A$7:$K$350,9,0),\"\")","v":""},{"$f":"IF(Formula!D11*(Formula!F11/100)=0,\"\",Formula!D11*(Formula!F11/100))","v":""},"",{"$f":"IFERROR(IF(VLOOKUP($A11,'DID-list 2023'!$A$7:$K$350,10,0)=\"R\",0,$I11)*OR(IF(VLOOKUP($A11,'DID-list 2023'!$A$7:$K$350,10,0)=\"NA\",0,$I11)),$I11)","v":""},{"$f":"IFERROR(IF(VLOOKUP($A11,'DID-list 2023'!$A$7:$K$350,11,0)=\"Y\",0,$I11)*OR(IF(VLOOKUP($A11,'DID-list 2023'!$A$7:$K$350,11,0)=\"NA\",0,$I11)),$I11)","v":""},"",{"$f":"IF(H11=\"\",\"\",IF(H11*Formula!O11=0,\"\",H11*Formula!O11))","v":""},{"$f":"IF(H11=\"\",\"\",IF(H11*Formula!P11=0,\"\",H11*Formula!P11))","v":""},{"$f":"IF(H11=\"\",\"\",IF(H11*Formula!Q11=0,\"\",H11*Formula!Q11))","v":""},""]
[{"$f":"IF(Formula!L12=0,\"\",Formula!L12)","v":""},{"$f":"IF(C12=\"\",\"\",IF(A12=\"\",NonDID,IFERROR(VLOOKUP(A12,'DID-list 2023'!$A$5:$K$350,2,0),Invalid)))","v":""},{"$f":"IF(Formula!C12=0,\"\",Formula!C12)","v":""},{"$f":"IF(Formula!E12=0,\"\",Formula!E12)","v":""},{"$f":"IFERROR(VLOOKUP($A12,'DID-list 2023'!$A$7:$K$350,8,0),\"\")","v":""},{"$f":"IFERROR(VLOOKUP($A12,'DID-list 2023'!$A$7:$K$350,5,0),\"\")","v":""},{"$f":"IFERROR(VLOOKUP($A12,'DID-list 2023'!$A$7:$K$350,9,0),\"\")","v":""},{"$f":"IF(Formula!D12*(Formula!F12/100)=0,\"\",Formula!D12*(Formula!F12/100))","v":""},"",{"$f":"IFERROR(IF(VLOOKUP($A12,'DID-list 2023'!$A$7:$K$350,10,0)=\"R\",0,$I12)*OR(IF(VLOOKUP($A12,'DID-list 2023'!$A$7:$K$350,10,0)=\"NA\",0,$I12)),$I12)","v":""},{"$f":"IFERROR(IF(VLOOKUP($A12,'DID-list 2023'!$A$7:$K$350,11,0)=\"Y\",0,$I12)*OR(IF(VLOOKUP($A12,'DID-list 2023'!$A$7:$K$350,11,0)=\"NA\",0,$I12)),$I12)","v":""},"",{"$f":"IF(H12=\"\",\"\",IF(H12*Formula!O12=0,\"\",H12*Formula!O12))","v":""},{"$f":"IF(H12=\"\",\"\",IF(H12*Formula!P12=0,\"\",H12*Formula!P12))","v":""},{"$f":"IF(H12=\"\",\"\",IF(H12*Formula!Q12=0,\"\",H12*Formula!Q12))","v":""},""]
[{"$f":"IF(Formula!L13=0,\"\",Formula!L13)","v":""},{"$f":"IF(C13=\"\",\"\",IF(A13=\"\",NonDID,IFERROR(VLOOKUP(A13,'DID-list 2023'!$A$5:$K$350,2,0),Invalid)))","v":""},{"$f":"IF(Formula!C13=0,\"\",Formula!C13)","v":""},{"$f":"IF(Formula!E13=0,\"\",Formula!E13)","v":""},{"$f":"IFERROR(VLOOKUP($A13,'DID-list 2023'!$A$7:$K$350,8,0),\"\")","v":""},{"$f":"IFERROR(VLOOKUP($A13,'DID-list 2023'!$A$7:$K$350,5,0),\"\")","v":""},{"$f":"IFERROR(VLOOKUP($A13,'DID-list 2023'!$A$7:$K$350,9,0),\"\")","v":""},{"$f":"IF(Formula!D13*(Formula!F13/100)=0,\"\",Formula!D13*(Formula!F13/100))","v":""},"",{"$f":"IFERROR(IF(VLOOKUP($A13,'DID-list 2023'!$A$7:$K$350,10,0)=\"R\",0,$I13)*OR(IF(VLOOKUP($A13,'DID-list 2023'!$A$7:$K$350,10,0)=\"NA\",0,$I13)),$I13)","v":""},{"$f":"IFERROR(IF(VLOOKUP($A13,'DID-list 2023'!$A$7:$K$350,11,0)=\"Y\",0,$I13)*OR(IF(VLOOKUP($A13,'DID-list 2023'!$A$7:$K$350,11,0)=\"NA\",0,$I13)),$I13)","v":""},"",{"$f":"IF(H13=\"\",\"\",IF(H13*Formula!O13=0,\"\",H13*Formula!O13))","v":""},{"$f":"IF(H13=\"\",\"\",IF(H13*Formula!P13=0,\"\",H13*Formula!P13))","v":""},{"$f":"IF(H13=\"\",\"\",IF(H13*Formula!Q13=0,\"\",H13*Formula!Q13))","v":""},""]
[{"$f":"IF(Formula!L14=0,\"\",Formula!L14)","v":""},{"$f":"IF(C14=\"\",\"\",IF(A14=\"\",NonDID,IFERROR(VLOOKUP(A14,'DID-list 2023'!$A$5:$K$350,2,0),Invalid)))","v":""},{"$f":"IF(Formula!C14=0,\"\",Formula!C14)","v":""},{"$f":"IF(Formula!E14=0,\"\",Formula!E14)","v":""},{"$f":"IFERROR(VLOOKUP($A14,'DID-list 2023'!$A$7:$K$350,8,0),\"\")","v":""},{"$f":"IFERROR(VLOOKUP($A14,'DID-list 2023'!$A$7:$K$350,5,0),\"\")","v":""},{"$f":"IFERROR(VLOOKUP($A14,'DID-list 2023'!$A$7:$K$350,9,0),\"\")","v":""},{"$f":"IF(Formula!D14*(Formula!F14/100)=0,\"\",Formula!D14*(Formula!F14/100))","v":""},"",{"$f":"IFERROR(IF(VLOOKUP($A14,'DID-list 2023'!$A$7:$K$350,10,0)=\"R\",0,$I14)*OR(IF(VLOOKUP($A14,'DID-list 2023'!$A$7:$K$350,10,0)=\"NA\",0,$I14)),$I14)","v":""},{"$f":"IFERROR(IF(VLOOKUP($A14,'DID-list 2023'!$A$7:$K$350,11,0)=\"Y\",0,$I14)*OR(IF(VLOOKUP($A14,'DID-list 2023'!$A$7:$K$350,11,0)=\"NA\",0,$I14)),$I14)","v":""},"",{"$f":"IF(H14=\"\",\"\",IF(H14*Formula!O14=0,\"\",H14*Formula!O14))","v":""},{"$f":"IF(H14=\"\",\"\",IF(H14*Formula!P14=0,\"\",H14*Formula!P14))","v":""},{"$f":"IF(H14=\"\",\"\",IF(H14*Formula!Q14=0,\"\",H14*Formula!Q14))","v":""},""]
[{"$f":"IF(Formula!L15=0,\"\",Formula!L15)","v":""},{"$f":"IF(C15=\"\",\"\",IF(A15=\"\",NonDID,IFERROR(VLOOKUP(A15,'DID-list 2023'!$A$5:$K$350,2,0),Invalid)))","v":""},{"$f":"IF(Formula!C15=0,\"\",Formula!C15)","v":""},{"$f":"IF(Formula!E15=0,\"\",Formula!E15)","v":""},{"$f":"IFERROR(VLOOKUP($A15,'DID-list 2023'!$A$7:$K$350,8,0),\"\")","v":""},{"$f":"IFERROR(VLOOKUP($A15,'DID-list 2023'!$A$7:$K$350,5,0),\"\")","v":""},{"$f":"IFERROR(VLOOKUP($A15,'DID-list 2023'!$A$7:$K$350,9,0),\"\")","v":""},{"$f":"IF(Formula!D15*(Formula!F15/100)=0,\"\",Formula!D15*(Formula!F15/100))","v":""},"",{"$f":"IFERROR(IF(VLOOKUP($A15,'DID-list 2023'!$A$7:$K$350,10,0)=\"R\",0,$I15)*OR(IF(VLOOKUP($A15,'DID-list 2023'!$A$7:$K$350,10,0)=\"NA\",0,$I15)),$I15)","v":""},{"$f":"IFERROR(IF(VLOOKUP($A15,'DID-list 2023'!$A$7:$K$350,11,0)=\"Y\",0,$I15)*OR(IF(VLOOKUP($A15,'DID-list 2023'!$A$7:$K$350,11,0)=\"NA\",0,$I15)),$I15)","v":""},"",{"$f":"IF(H15=\"\",\"\",IF(H15*Formula!O15=0,\"\",H15*Formula!O15))","v":""},{"$f":"IF(H15=\"\",\"\",IF(H15*Formula!P15=0,\"\",H15*Formula!P15))","v":""},{"$f":"IF(H15=\"\",\"\",IF(H15*Formula!Q15=0,\"\",H15*Formula!Q15))","v":""},""]
[{"$f":"IF(Formula!L16=0,\"\",Formula!L16)","v":""},{"$f":"IF(C16=\"\",\"\",IF(A16=\"\",NonDID,IFERROR(VLOOKUP(A16,'DID-list 2023'!$A$5:$K$350,2,0),Invalid)))","v":""},{"$f":"IF(Formula!C16=0,\"\",Formula!C16)","v":""},{"$f":"IF(Formula!E16=0,\"\",Formula!E16)","v":""},{"$f":"IFERROR(VLOOKUP($A16,'DID-list 2023'!$A$7:$K$350,8,0),\"\")","v":""},{"$f":"IFERROR(VLOOKUP($A16,'DID-list 2023'!$A$7:$K$350,5,0),\"\")","v":""},{"$f":"IFERROR(VLOOKUP($A16,'DID-list 2023'!$A$7:$K$350,9,0),\"\")","v":""},{"$f":"IF(Formula!D16*(Formula!F16/100)=0,\"\",Formula!D16*(Formula!F16/100))","v":""},"",{"$f":"IFERROR(IF(VLOOKUP($A16,'DID-list 2023'!$A$7:$K$350,10,0)=\"R\",0,$I16)*OR(IF(VLOOKUP($A16,'DID-list 2023'!$A$7:$K$350,10,0)=\"NA\",0,$I16)),$I16)","v":""},{"$f":"IFERROR(IF(VLOOKUP($A16,'DID-list 2023'!$A$7:$K$350,11,0)=\"Y\",0,$I16)*OR(IF(VLOOKUP($A16,'DID-list 2023'!$A$7:$K$350,11,0)=\"NA\",0,$I16)),$I16)","v":""},"",{"$f":"IF(H16=\"\",\"\",IF(H16*Formula!O16=0,\"\",H16*Formula!O16))","v":""},{"$f":"IF(H16=\"\",\"\",IF(H16*Formula!P16=0,\"\",H16*Formula!P16))","v":""},{"$f":"IF(H16=\"\",\"\",IF(H16*Formula!Q16=0,\"\",H16*Formula!Q16))","v":""},""]
[{"$f":"IF(Formula!L17=0,\"\",Formula!L17)","v":""},{"$f":"IF(C17=\"\",\"\",IF(A17=\"\",NonDID,IFERROR(VLOOKUP(A17,'DID-list 2023'!$A$5:$K$350,2,0),Invalid)))","v":""},{"$f":"IF(Formula!C17=0,\"\",Formula!C17)","v":""},{"$f":"IF(Formula!E17=0,\"\",Formula!E17)","v":""},{"$f":"IFERROR(VLOOKUP($A17,'DID-list 2023'!$A$7:$K$350,8,0),\"\")","v":""},{"$f":"IFERROR(VLOOKUP($A17,'DID-list 2023'!$A$7:$K$350,5,0),\"\")","v":""},{"$f":"IFERROR(VLOOKUP($A17,'DID-list 2023'!$A$7:$K$350,9,0),\"\")","v":""},{"$f":"IF(Formula!D17*(Formula!F17/100)=0,\"\",Formula!D17*(Formula!F17/100))","v":""},"",{"$f":"IFERROR(IF(VLOOKUP($A17,'DID-list 2023'!$A$7:$K$350,10,0)=\"R\",0,$I17)*OR(IF(VLOOKUP($A17,'DID-list 2023'!$A$7:$K$350,10,0)=\"NA\",0,$I17)),$I17)","v":""},{"$f":"IFERROR(IF(VLOOKUP($A17,'DID-list 2023'!$A$7:$K$350,11,0)=\"Y\",0,$I17)*OR(IF(VLOOKUP($A17,'DID-list 2023'!$A$7:$K$350,11,0)=\"NA\",0,$I17)),$I17)","v":""},"",{"$f":"IF(H17=\"\",\"\",IF(H17*Formula!O17=0,\"\",H17*Formula!O17))","v":""},{"$f":"IF(H17=\"\",\"\",IF(H17*Formula!P17=0,\"\",H17*Formula!P17))","v":""},{"$f":"IF(H17=\"\",\"\",IF(H17*Formula!Q17=0,\"\",H17*Formula!Q17))","v":""},""]
[{"$f":"IF(Formula!L18=0,\"\",Formula!L18)","v":""},{"$f":"IF(C18=\"\",\"\",IF(A18=\"\",NonDID,IFERROR(VLOOKUP(A18,'DID-list 2023'!$A$5:$K$350,2,0),Invalid)))","v":""},{"$f":"IF(Formula!C18=0,\"\",Formula!C18)","v":""},{"$f":"IF(Formula!E18=0,\"\",Formula!E18)","v":""},{"$f":"IFERROR(VLOOKUP($A18,'DID-list 2023'!$A$7:$K$350,8,0),\"\")","v":""},{"$f":"IFERROR(VLOOKUP($A18,'DID-list 2023'!$A$7:$K$350,5,0),\"\")","v":""},{"$f":"IFERROR(VLOOKUP($A18,'DID-list 2023'!$A$7:$K$350,9,0),\"\")","v":""},{"$f":"IF(Formula!D18*(Formula!F18/100)=0,\"\",Formula!D18*(Formula!F18/100))","v":""},"",{"$f":"IFERROR(IF(VLOOKUP($A18,'DID-list 2023'!$A$7:$K$350,10,0)=\"R\",0,$I18)*OR(IF(VLOOKUP($A18,'DID-list 2023'!$A$7:$K$350,10,0)=\"NA\",0,$I18)),$I18)","v":""},{"$f":"IFERROR(IF(VLOOKUP($A18,'DID-list 2023'!$A$7:$K$350,11,0)=\"Y\",0,$I18)*OR(IF(VLOOKUP($A18,'DID-list 2023'!$A$7:$K$350,11,0)=\"NA\",0,$I18)),$I18)","v":""},"",{"$f":"IF(H18=\"\",\"\",IF(H18*Formula!O18=0,\"\",H18*Formula!O18))","v":""},{"$f":"IF(H18=\"\",\"\",IF(H18*Formula!P18=0,\"\",H18*Formula!P18))","v":""},{"$f":"IF(H18=\"\",\"\",IF(H18*Formula!Q18=0,\"\",H18*Formula!Q18))","v":""},""]
[{"$f":"IF(Formula!L19=0,\"\",Formula!L19)","v":""},{"$f":"IF(C19=\"\",\"\",IF(A19=\"\",NonDID,IFERROR(VLOOKUP(A19,'DID-list 2023'!$A$5:$K$350,2,0),Invalid)))","v":""},{"$f":"IF(Formula!C19=0,\"\",Formula!C19)","v":""},{"$f":"IF(Formula!E19=0,\"\",Formula!E19)","v":""},{"$f":"IFERROR(VLOOKUP($A19,'DID-list 2023'!$A$7:$K$350,8,0),\"\")","v":""},{"$f":"IFERROR(VLOOKUP($A19,'DID-list 2023'!$A$7:$K$350,5,0),\"\")","v":""},{"$f":"IFERROR(VLOOKUP($A19,'DID-list 2023'!$A$7:$K$350,9,0),\"\")","v":""},{"$f":"IF(Formula!D19*(Formula!F19/100)=0,\"\",Formula!D19*(Formula!F19/100))","v":""},"",{"$f":"IFERROR(IF(VLOOKUP($A19,'DID-list 2023'!$A$7:$K$350,10,0)=\"R\",0,$I19)*OR(IF(VLOOKUP($A19,'DID-list 2023'!$A$7:$K$350,10,0)=\"NA\",0,$I19)),$I19)","v":""},{"$f":"IFERROR(IF(VLOOKUP($A19,'DID-list 2023'!$A$7:$K$350,11,0)=\"Y\",0,$I19)*OR(IF(VLOOKUP($A19,'DID-list 2023'!$A$7:$K$350,11,0)=\"NA\",0,$I19)),$I19)","v":""},"",{"$f":"IF(H19=\"\",\"\",IF(H19*Formula!O19=0,\"\",H19*Formula!O19))","v":""},{"$f":"IF(H19=\"\",\"\",IF(H19*Formula!P19=0,\"\",H19*Formula!P19))","v":""},{"$f":"IF(H19=\"\",\"\",IF(H19*Formula!Q19=0,\"\",H19*Formula!Q19))","v":""},""]
[{"$f":"IF(Formula!L20=0,\"\",Formula!L20)","v":""},{"$f":"IF(C20=\"\",\"\",IF(A20=\"\",NonDID,IFERROR(VLOOKUP(A20,'DID-list 2023'!$A$5:$K$350,2,0),Invalid)))","v":""},{"$f":"IF(Formula!C20=0,\"\",Formula!C20)","v":""},{"$f":"IF(Formula!E20=0,\"\",Formula!E20)","v":""},{"$f":"IFERROR(VLOOKUP($A20,'DID-list 2023'!$A$7:$K$350,8,0),\"\")","v":""},{"$f":"IFERROR(VLOOKUP($A20,'DID-list 2023'!$A$7:$K$350,5,0),\"\")","v":""},{"$f":"IFERROR(VLOOKUP($A20,'DID-list 2023'!$A$7:$K$350,9,0),\"\")","v":""},{"$f":"IF(Formula!D20*(Formula!F20/100)=0,\"\",Formula!D20*(Formula!F20/100))","v":""},"",{"$f":"IFERROR(IF(VLOOKUP($A20,'DID-list 2023'!$A$7:$K$350,10,0)=\"R\",0,$I20)*OR(IF(VLOOKUP($A20,'DID-list 2023'!$A$7:$K$350,10,0)=\"NA\",0,$I20)),$I20)","v":""},{"$f":"IFERROR(IF(VLOOKUP($A20,'DID-list 2023'!$A$7:$K$350,11,0)=\"Y\",0,$I20)*OR(IF(VLOOKUP($A20,'DID-list 2023'!$A$7:$K$350,11,0)=\"NA\",0,$I20)),$I20)","v":""},"",{"$f":"IF(H20=\"\",\"\",IF(H20*Formula!O20=0,\"\",H20*Formula!O20))","v":""},{"$f":"IF(H20=\"\",\"\",IF(H20*Formula!P20=0,\"\",H20*Formula!P20))","v":""},{"$f":"IF(H20=\"\",\"\",IF(H20*Formula!Q20=0,\"\",H20*Formula!Q20))","v":""},""]
[{"$f":"IF(Formula!L21=0,\"\",Formula!L21)","v":""},{"$f":"IF(C21=\"\",\"\",IF(A21=\"\",NonDID,IFERROR(VLOOKUP(A21,'DID-list 2023'!$A$5:$K$350,2,0),Invalid)))","v":""},{"$f":"IF(Formula!C21=0,\"\",Formula!C21)","v":""},{"$f":"IF(Formula!E21=0,\"\",Formula!E21)","v":""},{"$f":"IFERROR(VLOOKUP($A21,'DID-list 2023'!$A$7:$K$350,8,0),\"\")","v":""},{"$f":"IFERROR(VLOOKUP($A21,'DID-list 2023'!$A$7:$K$350,5,0),\"\")","v":""},{"$f":"IFERROR(VLOOKUP($A21,'DID-list 2023'!$A$7:$K$350,9,0),\"\")","v":""},{"$f":"IF(Formula!D21*(Formula!F21/100)=0,\"\",Formula!D21*(Formula!F21/100))","v":""},"",{"$f":"IFERROR(IF(VLOOKUP($A21,'DID-list 2023'!$A$7:$K$350,10,0)=\"R\",0,$I21)*OR(IF(VLOOKUP($A21,'DID-list 2023'!$A$7:$K$350,10,0)=\"NA\",0,$I21)),$I21)","v":""},{"$f":"IFERROR(IF(VLOOKUP($A21,'DID-list 2023'!$A$7:$K$350,11,0)=\"Y\",0,$I21)*OR(IF(VLOOKUP($A21,'DID-list 2023'!$A$7:$K$350,11,0)=\"NA\",0,$I21)),$I21)","v":""},"",{"$f":"IF(H21=\"\",\"\",IF(H21*Formula!O21=0,\"\",H21*Formula!O21))","v":""},{"$f":"IF(H21=\"\",\"\",IF(H21*Formula!P21=0,\"\",H21*Formula!P21))","v":""},{"$f":"IF(H21=\"\",\"\",IF(H21*Formula!Q21=0,\"\",H21*Formula!Q21))","v":""},""]
[{"$f":"IF(Formula!L22=0,\"\",Formula!L22)","v":""},{"$f":"IF(C22=\"\",\"\",IF(A22=\"\",NonDID,IFERROR(VLOOKUP(A22,'DID-list 2023'!$A$5:$K$350,2,0),Invalid)))","v":""},{"$f":"IF(Formula!C22=0,\"\",Formula!C22)","v":""},{"$f":"IF(Formula!E22=0,\"\",Formula!E22)","v":""},{"$f":"IFERROR(VLOOKUP($A22,'DID-list 2023'!$A$7:$K$350,8,0),\"\")","v":""},{"$f":"IFERROR(VLOOKUP($A22,'DID-list 2023'!$A$7:$K$350,5,0),\"\")","v":""},{"$f":"IFERROR(VLOOKUP($A22,'DID-list 2023'!$A$7:$K$350,9,0),\"\")","v":""},{"$f":"IF(Formula!D22*(Formula!F22/100)=0,\"\",Formula!D22*(Formula!F22/100))","v":""},"",{"$f":"IFERROR(IF(VLOOKUP($A22,'DID-list 2023'!$A$7:$K$350,10,0)=\"R\",0,$I22)*OR(IF(VLOOKUP($A22,'DID-list 2023'!$A$7:$K$350,10,0)=\"NA\",0,$I22)),$I22)","v":""},{"$f":"IFERROR(IF(VLOOKUP($A22,'DID-list 2023'!$A$7:$K$350,11,0)=\"Y\",0,$I22)*OR(IF(VLOOKUP($A22,'DID-list 2023'!$A$7:$K$350,11,0)=\"NA\",0,$I22)),$I22)","v":""},"",{"$f":"IF(H22=\"\",\"\",IF(H22*Formula!O22=0,\"\",H22*Formula!O22))","v":""},{"$f":"IF(H22=\"\",\"\",IF(H22*Formula!P22=0,\"\",H22*Formula!P22))","v":""},{"$f":"IF(H22=\"\",\"\",IF(H22*Formula!Q22=0,\"\",H22*Formula!Q22))","v":""},""]
[{"$f":"IF(Formula!L23=0,\"\",Formula!L23)","v":""},{"$f":"IF(C23=\"\",\"\",IF(A23=\"\",NonDID,IFERROR(VLOOKUP(A23,'DID-list 2023'!$A$5:$K$350,2,0),Invalid)))","v":""},{"$f":"IF(Formula!C23=0,\"\",Formula!C23)","v":""},{"$f":"IF(Formula!E23=0,\"\",Formula!E23)","v":""},{"$f":"IFERROR(VLOOKUP($A23,'DID-list 2023'!$A$7:$K$350,8,0),\"\")","v":""},{"$f":"IFERROR(VLOOKUP($A23,'DID-list 2023'!$A$7:$K$350,5,0),\"\")","v":""},{"$f":"IFERROR(VLOOKUP($A23,'DID-list 2023'!$A$7:$K$350,9,0),\"\")","v":""},{"$f":"IF(Formula!D23*(Formula!F23/100)=0,\"\",Formula!D23*(Formula!F23/100))","v":""},"",{"$f":"IFERROR(IF(VLOOKUP($A23,'DID-list 2023'!$A$7:$K$350,10,0)=\"R\",0,$I23)*OR(IF(VLOOKUP($A23,'DID-list 2023'!$A$7:$K$350,10,0)=\"NA\",0,$I23)),$I23)","v":""},{"$f":"IFERROR(IF(VLOOKUP($A23,'DID-list 2023'!$A$7:$K$350,11,0)=\"Y\",0,$I23)*OR(IF(VLOOKUP($A23,'DID-list 2023'!$A$7:$K$350,11,0)=\"NA\",0,$I23)),$I23)","v":""},"",{"$f":"IF(H23=\"\",\"\",IF(H23*Formula!O23=0,\"\",H23*Formula!O23))","v":""},{"$f":"IF(H23=\"\",\"\",IF(H23*Formula!P23=0,\"\",H23*Formula!P23))","v":""},{"$f":"IF(H23=\"\",\"\",IF(H23*Formula!Q23=0,\"\",H23*Formula!Q23))","v":""},""]
[{"$f":"IF(Formula!L24=0,\"\",Formula!L24)","v":""},{"$f":"IF(C24=\"\",\"\",IF(A24=\"\",NonDID,IFERROR(VLOOKUP(A24,'DID-list 2023'!$A$5:$K$350,2,0),Invalid)))","v":""},{"$f":"IF(Formula!C24=0,\"\",Formula!C24)","v":""},{"$f":"IF(Formula!E24=0,\"\",Formula!E24)","v":""},{"$f":"IFERROR(VLOOKUP($A24,'DID-list 2023'!$A$7:$K$350,8,0),\"\")","v":""},{"$f":"IFERROR(VLOOKUP($A24,'DID-list 2023'!$A$7:$K$350,5,0),\"\")","v":""},{"$f":"IFERROR(VLOOKUP($A24,'DID-list 2023'!$A$7:$K$350,9,0),\"\")","v":""},{"$f":"IF(Formula!D24*(Formula!F24/100)=0,\"\",Formula!D24*(Formula!F24/100))","v":""},"",{"$f":"IFERROR(IF(VLOOKUP($A24,'DID-list 2023'!$A$7:$K$350,10,0)=\"R\",0,$I24)*OR(IF(VLOOKUP($A24,'DID-list 2023'!$A$7:$K$350,10,0)=\"NA\",0,$I24)),$I24)","v":""},{"$f":"IFERROR(IF(VLOOKUP($A24,'DID-list 2023'!$A$7:$K$350,11,0)=\"Y\",0,$I24)*OR(IF(VLOOKUP($A24,'DID-list 2023'!$A$7:$K$350,11,0)=\"NA\",0,$I24)),$I24)","v":""},"",{"$f":"IF(H24=\"\",\"\",IF(H24*Formula!O24=0,\"\",H24*Formula!O24))","v":""},{"$f":"IF(H24=\"\",\"\",IF(H24*Formula!P24=0,\"\",H24*Formula!P24))","v":""},{"$f":"IF(H24=\"\",\"\",IF(H24*Formula!Q24=0,\"\",H24*Formula!Q24))","v":""},""]
[{"$f":"IF(Formula!L25=0,\"\",Formula!L25)","v":""},{"$f":"IF(C25=\"\",\"\",IF(A25=\"\",NonDID,IFERROR(VLOOKUP(A25,'DID-list 2023'!$A$5:$K$350,2,0),Invalid)))","v":""},{"$f":"IF(Formula!C25=0,\"\",Formula!C25)","v":""},{"$f":"IF(Formula!E25=0,\"\",Formula!E25)","v":""},{"$f":"IFERROR(VLOOKUP($A25,'DID-list 2023'!$A$7:$K$350,8,0),\"\")","v":""},{"$f":"IFERROR(VLOOKUP($A25,'DID-list 2023'!$A$7:$K$350,5,0),\"\")","v":""},{"$f":"IFERROR(VLOOKUP($A25,'DID-list 2023'!$A$7:$K$350,9,0),\"\")","v":""},{"$f":"IF(Formula!D25*(Formula!F25/100)=0,\"\",Formula!D25*(Formula!F25/100))","v":""},"",{"$f":"IFERROR(IF(VLOOKUP($A25,'DID-list 2023'!$A$7:$K$350,10,0)=\"R\",0,$I25)*OR(IF(VLOOKUP($A25,'DID-list 2023'!$A$7:$K$350,10,0)=\"NA\",0,$I25)),$I25)","v":""},{"$f":"IFERROR(IF(VLOOKUP($A25,'DID-list 2023'!$A$7:$K$350,11,0)=\"Y\",0,$I25)*OR(IF(VLOOKUP($A25,'DID-list 2023'!$A$7:$K$350,11,0)=\"NA\",0,$I25)),$I25)","v":""},"",{"$f":"IF(H25=\"\",\"\",IF(H25*Formula!O25=0,\"\",H25*Formula!O25))","v":""},{"$f":"IF(H25=\"\",\"\",IF(H25*Formula!P25=0,\"\",H25*Formula!P25))","v":""},{"$f":"IF(H25=\"\",\"\",IF(H25*Formula!Q25=0,\"\",H25*Formula!Q25))","v":""},""]
[{"$f":"IF(Formula!L26=0,\"\",Formula!L26)","v":""},{"$f":"IF(C26=\"\",\"\",IF(A26=\"\",NonDID,IFERROR(VLOOKUP(A26,'DID-list 2023'!$A$5:$K$350,2,0),Invalid)))","v":""},{"$f":"IF(Formula!C26=0,\"\",Formula!C26)","v":""},{"$f":"IF(Formula!E26=0,\"\",Formula!E26)","v":""},{"$f":"IFERROR(VLOOKUP($A26,'DID-list 2023'!$A$7:$K$350,8,0),\"\")","v":""},{"$f":"IFERROR(VLOOKUP($A26,'DID-list 2023'!$A$7:$K$350,5,0),\"\")","v":""},{"$f":"IFERROR(VLOOKUP($A26,'DID-list 2023'!$A$7:$K$350,9,0),\"\")","v":""},{"$f":"IF(Formula!D26*(Formula!F26/100)=0,\"\",Formula!D26*(Formula!F26/100))","v":""},"",{"$f":"IFERROR(IF(VLOOKUP($A26,'DID-list 2023'!$A$7:$K$350,10,0)=\"R\",0,$I26)*OR(IF(VLOOKUP($A26,'DID-list 2023'!$A$7:$K$350,10,0)=\"NA\",0,$I26)),$I26)","v":""},{"$f":"IFERROR(IF(VLOOKUP($A26,'DID-list 2023'!$A$7:$K$350,11,0)=\"Y\",0,$I26)*OR(IF(VLOOKUP($A26,'DID-list 2023'!$A$7:$K$350,11,0)=\"NA\",0,$I26)),$I26)","v":""},"",{"$f":"IF(H26=\"\",\"\",IF(H26*Formula!O26=0,\"\",H26*Formula!O26))","v":""},{"$f":"IF(H26=\"\",\"\",IF(H26*Formula!P26=0,\"\",H26*Formula!P26))","v":""},{"$f":"IF(H26=\"\",\"\",IF(H26*Formula!Q26=0,\"\",H26*Formula!Q26))","v":""},""]
[{"$f":"IF(Formula!L27=0,\"\",Formula!L27)","v":""},{"$f":"IF(C27=\"\",\"\",IF(A27=\"\",NonDID,IFERROR(VLOOKUP(A27,'DID-list 2023'!$A$5:$K$350,2,0),Invalid)))","v":""},{"$f":"IF(Formula!C27=0,\"\",Formula!C27)","v":""},{"$f":"IF(Formula!E27=0,\"\",Formula!E27)","v":""},{"$f":"IFERROR(VLOOKUP($A27,'DID-list 2023'!$A$7:$K$350,8,0),\"\")","v":""},{"$f":"IFERROR(VLOOKUP($A27,'DID-list 2023'!$A$7:$K$350,5,0),\"\")","v":""},{"$f":"IFERROR(VLOOKUP($A27,'DID-list 2023'!$A$7:$K$350,9,0),\"\")","v":""},{"$f":"IF(Formula!D27*(Formula!F27/100)=0,\"\",Formula!D27*(Formula!F27/100))","v":""},"",{"$f":"IFERROR(IF(VLOOKUP($A27,'DID-list 2023'!$A$7:$K$350,10,0)=\"R\",0,$I27)*OR(IF(VLOOKUP($A27,'DID-list 2023'!$A$7:$K$350,10,0)=\"NA\",0,$I27)),$I27)","v":""},{"$f":"IFERROR(IF(VLOOKUP($A27,'DID-list 2023'!$A$7:$K$350,11,0)=\"Y\",0,$I27)*OR(IF(VLOOKUP($A27,'DID-list 2023'!$A$7:$K$350,11,0)=\"NA\",0,$I27)),$I27)","v":""},"",{"$f":"IF(H27=\"\",\"\",IF(H27*Formula!O27=0,\"\",H27*Formula!O27))","v":""},{"$f":"IF(H27=\"\",\"\",IF(H27*Formula!P27=0,\"\",H27*Formula!P27))","v":""},{"$f":"IF(H27=\"\",\"\",IF(H27*Formula!Q27=0,\"\",H27*Formula!Q27))","v":""},""]
[{"$f":"IF(Formula!L28=0,\"\",Formula!L28)","v":""},{"$f":"IF(C28=\"\",\"\",IF(A28=\"\",NonDID,IFERROR(VLOOKUP(A28,'DID-list 2023'!$A$5:$K$350,2,0),Invalid)))","v":""},{"$f":"IF(Formula!C28=0,\"\",Formula!C28)","v":""},{"$f":"IF(Formula!E28=0,\"\",Formula!E28)","v":""},{"$f":"IFERROR(VLOOKUP($A28,'DID-list 2023'!$A$7:$K$350,8,0),\"\")","v":""},{"$f":"IFERROR(VLOOKUP($A28,'DID-list 2023'!$A$7:$K$350,5,0),\"\")","v":""},{"$f":"IFERROR(VLOOKUP($A28,'DID-list 2023'!$A$7:$K$350,9,0),\"\")","v":""},{"$f":"IF(Formula!D28*(Formula!F28/100)=0,\"\",Formula!D28*(Formula!F28/100))","v":""},"",{"$f":"IFERROR(IF(VLOOKUP($A28,'DID-list 2023'!$A$7:$K$350,10,0)=\"R\",0,$I28)*OR(IF(VLOOKUP($A28,'DID-list 2023'!$A$7:$K$350,10,0)=\"NA\",0,$I28)),$I28)","v":""},{"$f":"IFERROR(IF(VLOOKUP($A28,'DID-list 2023'!$A$7:$K$350,11,0)=\"Y\",0,$I28)*OR(IF(VLOOKUP($A28,'DID-list 2023'!$A$7:$K$350,11,0)=\"NA\",0,$I28)),$I28)","v":""},"",{"$f":"IF(H28=\"\",\"\",IF(H28*Formula!O28=0,\"\",H28*Formula!O28))","v":""},{"$f":"IF(H28=\"\",\"\",IF(H28*Formula!P28=0,\"\",H28*Formula!P28))","v":""},{"$f":"IF(H28=\"\",\"\",IF(H28*Formula!Q28=0,\"\",H28*Formula!Q28))","v":""},""]
[{"$f":"IF(Formula!L29=0,\"\",Formula!L29)","v":""},{"$f":"IF(C29=\"\",\"\",IF(A29=\"\",NonDID,IFERROR(VLOOKUP(A29,'DID-list 2023'!$A$5:$K$350,2,0),Invalid)))","v":""},{"$f":"IF(Formula!C29=0,\"\",Formula!C29)","v":""},{"$f":"IF(Formula!E29=0,\"\",Formula!E29)","v":""},{"$f":"IFERROR(VLOOKUP($A29,'DID-list 2023'!$A$7:$K$350,8,0),\"\")","v":""},{"$f":"IFERROR(VLOOKUP($A29,'DID-list 2023'!$A$7:$K$350,5,0),\"\")","v":""},{"$f":"IFERROR(VLOOKUP($A29,'DID-list 2023'!$A$7:$K$350,9,0),\"\")","v":""},{"$f":"IF(Formula!D29*(Formula!F29/100)=0,\"\",Formula!D29*(Formula!F29/100))","v":""},"",{"$f":"IFERROR(IF(VLOOKUP($A29,'DID-list 2023'!$A$7:$K$350,10,0)=\"R\",0,$I29)*OR(IF(VLOOKUP($A29,'DID-list 2023'!$A$7:$K$350,10,0)=\"NA\",0,$I29)),$I29)","v":""},{"$f":"IFERROR(IF(VLOOKUP($A29,'DID-list 2023'!$A$7:$K$350,11,0)=\"Y\",0,$I29)*OR(IF(VLOOKUP($A29,'DID-list 2023'!$A$7:$K$350,11,0)=\"NA\",0,$I29)),$I29)","v":""},"",{"$f":"IF(H29=\"\",\"\",IF(H29*Formula!O29=0,\"\",H29*Formula!O29))","v":""},{"$f":"IF(H29=\"\",\"\",IF(H29*Formula!P29=0,\"\",H29*Formula!P29))","v":""},{"$f":"IF(H29=\"\",\"\",IF(H29*Formula!Q29=0,\"\",H29*Formula!Q29))","v":""},""]
[{"$f":"IF(Formula!L30=0,\"\",Formula!L30)","v":""},{"$f":"IF(C30=\"\",\"\",IF(A30=\"\",NonDID,IFERROR(VLOOKUP(A30,'DID-list 2023'!$A$5:$K$350,2,0),Invalid)))","v":""},{"$f":"IF(Formula!C30=0,\"\",Formula!C30)","v":""},{"$f":"IF(Formula!E30=0,\"\",Formula!E30)","v":""},{"$f":"IFERROR(VLOOKUP($A30,'DID-list 2023'!$A$7:$K$350,8,0),\"\")","v":""},{"$f":"IFERROR(VLOOKUP($A30,'DID-list 2023'!$A$7:$K$350,5,0),\"\")","v":""},{"$f":"IFERROR(VLOOKUP($A30,'DID-list 2023'!$A$7:$K$350,9,0),\"\")","v":""},{"$f":"IF(Formula!D30*(Formula!F30/100)=0,\"\",Formula!D30*(Formula!F30/100))","v":""},"",{"$f":"IFERROR(IF(VLOOKUP($A30,'DID-list 2023'!$A$7:$K$350,10,0)=\"R\",0,$I30)*OR(IF(VLOOKUP($A30,'DID-list 2023'!$A$7:$K$350,10,0)=\"NA\",0,$I30)),$I30)","v":""},{"$f":"IFERROR(IF(VLOOKUP($A30,'DID-list 2023'!$A$7:$K$350,11,0)=\"Y\",0,$I30)*OR(IF(VLOOKUP($A30,'DID-list 2023'!$A$7:$K$350,11,0)=\"NA\",0,$I30)),$I30)","v":""},"",{"$f":"IF(H30=\"\",\"\",IF(H30*Formula!O30=0,\"\",H30*Formula!O30))","v":""},{"$f":"IF(H30=\"\",\"\",IF(H30*Formula!P30=0,\"\",H30*Formula!P30))","v":""},{"$f":"IF(H30=\"\",\"\",IF(H30*Formula!Q30=0,\"\",H30*Formula!Q30))","v":""},""]
[{"$f":"IF(Formula!L31=0,\"\",Formula!L31)","v":""},{"$f":"IF(C31=\"\",\"\",IF(A31=\"\",NonDID,IFERROR(VLOOKUP(A31,'DID-list 2023'!$A$5:$K$350,2,0),Invalid)))","v":""},{"$f":"IF(Formula!C31=0,\"\",Formula!C31)","v":""},{"$f":"IF(Formula!E31=0,\"\",Formula!E31)","v":""},{"$f":"IFERROR(VLOOKUP($A31,'DID-list 2023'!$A$7:$K$350,8,0),\"\")","v":""},{"$f":"IFERROR(VLOOKUP($A31,'DID-list 2023'!$A$7:$K$350,5,0),\"\")","v":""},{"$f":"IFERROR(VLOOKUP($A31,'DID-list 2023'!$A$7:$K$350,9,0),\"\")","v":""},{"$f":"IF(Formula!D31*(Formula!F31/100)=0,\"\",Formula!D31*(Formula!F31/100))","v":""},"",{"$f":"IFERROR(IF(VLOOKUP($A31,'DID-list 2023'!$A$7:$K$350,10,0)=\"R\",0,$I31)*OR(IF(VLOOKUP($A31,'DID-list 2023'!$A$7:$K$350,10,0)=\"NA\",0,$I31)),$I31)","v":""},{"$f":"IFERROR(IF(VLOOKUP($A31,'DID-list 2023'!$A$7:$K$350,11,0)=\"Y\",0,$I31)*OR(IF(VLOOKUP($A31,'DID-list 2023'!$A$7:$K$350,11,0)=\"NA\",0,$I31)),$I31)","v":""},"",{"$f":"IF(H31=\"\",\"\",IF(H31*Formula!O31=0,\"\",H31*Formula!O31))","v":""},{"$f":"IF(H31=\"\",\"\",IF(H31*Formula!P31=0,\"\",H31*Formula!P31))","v":""},{"$f":"IF(H31=\"\",\"\",IF(H31*Formula!Q31=0,\"\",H31*Formula!Q31))","v":""},""]
[{"$f":"IF(Formula!L32=0,\"\",Formula!L32)","v":""},{"$f":"IF(C32=\"\",\"\",IF(A32=\"\",NonDID,IFERROR(VLOOKUP(A32,'DID-list 2023'!$A$5:$K$350,2,0),Invalid)))","v":""},{"$f":"IF(Formula!C32=0,\"\",Formula!C32)","v":""},{"$f":"IF(Formula!E32=0,\"\",Formula!E32)","v":""},{"$f":"IFERROR(VLOOKUP($A32,'DID-list 2023'!$A$7:$K$350,8,0),\"\")","v":""},{"$f":"IFERROR(VLOOKUP($A32,'DID-list 2023'!$A$7:$K$350,5,0),\"\")","v":""},{"$f":"IFERROR(VLOOKUP($A32,'DID-list 2023'!$A$7:$K$350,9,0),\"\")","v":""},{"$f":"IF(Formula!D32*(Formula!F32/100)=0,\"\",Formula!D32*(Formula!F32/100))","v":""},"",{"$f":"IFERROR(IF(VLOOKUP($A32,'DID-list 2023'!$A$7:$K$350,10,0)=\"R\",0,$I32)*OR(IF(VLOOKUP($A32,'DID-list 2023'!$A$7:$K$350,10,0)=\"NA\",0,$I32)),$I32)","v":""},{"$f":"IFERROR(IF(VLOOKUP($A32,'DID-list 2023'!$A$7:$K$350,11,0)=\"Y\",0,$I32)*OR(IF(VLOOKUP($A32,'DID-list 2023'!$A$7:$K$350,11,0)=\"NA\",0,$I32)),$I32)","v":""},"",{"$f":"IF(H32=\"\",\"\",IF(H32*Formula!O32=0,\"\",H32*Formula!O32))","v":""},{"$f":"IF(H32=\"\",\"\",IF(H32*Formula!P32=0,\"\",H32*Formula!P32))","v":""},{"$f":"IF(H32=\"\",\"\",IF(H32*Formula!Q32=0,\"\",H32*Formula!Q32))","v":""},""]
[{"$f":"IF(Formula!L33=0,\"\",Formula!L33)","v":""},{"$f":"IF(C33=\"\",\"\",IF(A33=\"\",NonDID,IFERROR(VLOOKUP(A33,'DID-list 2023'!$A$5:$K$350,2,0),Invalid)))","v":""},{"$f":"IF(Formula!C33=0,\"\",Formula!C33)","v":""},{"$f":"IF(Formula!E33=0,\"\",Formula!E33)","v":""},{"$f":"IFERROR(VLOOKUP($A33,'DID-list 2023'!$A$7:$K$350,8,0),\"\")","v":""},{"$f":"IFERROR(VLOOKUP($A33,'DID-list 2023'!$A$7:$K$350,5,0),\"\")","v":""},{"$f":"IFERROR(VLOOKUP($A33,'DID-list 2023'!$A$7:$K$350,9,0),\"\")","v":""},{"$f":"IF(Formula!D33*(Formula!F33/100)=0,\"\",Formula!D33*(Formula!F33/100))","v":""},"",{"$f":"IFERROR(IF(VLOOKUP($A33,'DID-list 2023'!$A$7:$K$350,10,0)=\"R\",0,$I33)*OR(IF(VLOOKUP($A33,'DID-list 2023'!$A$7:$K$350,10,0)=\"NA\",0,$I33)),$I33)","v":""},{"$f":"IFERROR(IF(VLOOKUP($A33,'DID-list 2023'!$A$7:$K$350,11,0)=\"Y\",0,$I33)*OR(IF(VLOOKUP($A33,'DID-list 2023'!$A$7:$K$350,11,0)=\"NA\",0,$I33)),$I33)","v":""},"",{"$f":"IF(H33=\"\",\"\",IF(H33*Formula!O33=0,\"\",H33*Formula!O33))","v":""},{"$f":"IF(H33=\"\",\"\",IF(H33*Formula!P33=0,\"\",H33*Formula!P33))","v":""},{"$f":"IF(H33=\"\",\"\",IF(H33*Formula!Q33=0,\"\",H33*Formula!Q33))","v":""},""]
[{"$f":"IF(Formula!L34=0,\"\",Formula!L34)","v":""},{"$f":"IF(C34=\"\",\"\",IF(A34=\"\",NonDID,IFERROR(VLOOKUP(A34,'DID-list 2023'!$A$5:$K$350,2,0),Invalid)))","v":""},{"$f":"IF(Formula!C34=0,\"\",Formula!C34)","v":""},{"$f":"IF(Formula!E34=0,\"\",Formula!E34)","v":""},{"$f":"IFERROR(VLOOKUP($A34,'DID-list 2023'!$A$7:$K$350,8,0),\"\")","v":""},{"$f":"IFERROR(VLOOKUP($A34,'DID-list 2023'!$A$7:$K$350,5,0),\"\")","v":""},{"$f":"IFERROR(VLOOKUP($A34,'DID-list 2023'!$A$7:$K$350,9,0),\"\")","v":""},{"$f":"IF(Formula!D34*(Formula!F34/100)=0,\"\",Formula!D34*(Formula!F34/100))","v":""},"",{"$f":"IFERROR(IF(VLOOKUP($A34,'DID-list 2023'!$A$7:$K$350,10,0)=\"R\",0,$I34)*OR(IF(VLOOKUP($A34,'DID-list 2023'!$A$7:$K$350,10,0)=\"NA\",0,$I34)),$I34)","v":""},{"$f":"IFERROR(IF(VLOOKUP($A34,'DID-list 2023'!$A$7:$K$350,11,0)=\"Y\",0,$I34)*OR(IF(VLOOKUP($A34,'DID-list 2023'!$A$7:$K$350,11,0)=\"NA\",0,$I34)),$I34)","v":""},"",{"$f":"IF(H34=\"\",\"\",IF(H34*Formula!O34=0,\"\",H34*Formula!O34))","v":""},{"$f":"IF(H34=\"\",\"\",IF(H34*Formula!P34=0,\"\",H34*Formula!P34))","v":""},{"$f":"IF(H34=\"\",\"\",IF(H34*Formula!Q34=0,\"\",H34*Formula!Q34))","v":""},""]
[{"$f":"IF(Formula!L35=0,\"\",Formula!L35)","v":""},{"$f":"IF(C35=\"\",\"\",IF(A35=\"\",NonDID,IFERROR(VLOOKUP(A35,'DID-list 2023'!$A$5:$K$350,2,0),Invalid)))","v":""},{"$f":"IF(Formula!C35=0,\"\",Formula!C35)","v":""},{"$f":"IF(Formula!E35=0,\"\",Formula!E35)","v":""},{"$f":"IFERROR(VLOOKUP($A35,'DID-list 2023'!$A$7:$K$350,8,0),\"\")","v":""},{"$f":"IFERROR(VLOOKUP($A35,'DID-list 2023'!$A$7:$K$350,5,0),\"\")","v":""},{"$f":"IFERROR(VLOOKUP($A35,'DID-list 2023'!$A$7:$K$350,9,0),\"\")","v":""},{"$f":"IF(Formula!D35*(Formula!F35/100)=0,\"\",Formula!D35*(Formula!F35/100))","v":""},"",{"$f":"IFERROR(IF(VLOOKUP($A35,'DID-list 2023'!$A$7:$K$350,10,0)=\"R\",0,$I35)*OR(IF(VLOOKUP($A35,'DID-list 2023'!$A$7:$K$350,10,0)=\"NA\",0,$I35)),$I35)","v":""},{"$f":"IFERROR(IF(VLOOKUP($A35,'DID-list 2023'!$A$7:$K$350,11,0)=\"Y\",0,$I35)*OR(IF(VLOOKUP($A35,'DID-list 2023'!$A$7:$K$350,11,0)=\"NA\",0,$I35)),$I35)","v":""},"",{"$f":"IF(H35=\"\",\"\",IF(H35*Formula!O35=0,\"\",H35*Formula!O35))","v":""},{"$f":"IF(H35=\"\",\"\",IF(H35*Formula!P35=0,\"\",H35*Formula!P35))","v":""},{"$f":"IF(H35=\"\",\"\",IF(H35*Formula!Q35=0,\"\",H35*Formula!Q35))","v":""},""]
[{"$f":"IF(Formula!L36=0,\"\",Formula!L36)","v":""},{"$f":"IF(C36=\"\",\"\",IF(A36=\"\",NonDID,IFERROR(VLOOKUP(A36,'DID-list 2023'!$A$5:$K$350,2,0),Invalid)))","v":""},{"$f":"IF(Formula!C36=0,\"\",Formula!C36)","v":""},{"$f":"IF(Formula!E36=0,\"\",Formula!E36)","v":""},{"$f":"IFERROR(VLOOKUP($A36,'DID-list 2023'!$A$7:$K$350,8,0),\"\")","v":""},{"$f":"IFERROR(VLOOKUP($A36,'DID-list 2023'!$A$7:$K$350,5,0),\"\")","v":""},{"$f":"IFERROR(VLOOKUP($A36,'DID-list 2023'!$A$7:$K$350,9,0),\"\")","v":""},{"$f":"IF(Formula!D36*(Formula!F36/100)=0,\"\",Formula!D36*(Formula!F36/100))","v":""},"",{"$f":"IFERROR(IF(VLOOKUP($A36,'DID-list 2023'!$A$7:$K$350,10,0)=\"R\",0,$I36)*OR(IF(VLOOKUP($A36,'DID-list 2023'!$A$7:$K$350,10,0)=\"NA\",0,$I36)),$I36)","v":""},{"$f":"IFERROR(IF(VLOOKUP($A36,'DID-list 2023'!$A$7:$K$350,11,0)=\"Y\",0,$I36)*OR(IF(VLOOKUP($A36,'DID-list 2023'!$A$7:$K$350,11,0)=\"NA\",0,$I36)),$I36)","v":""},"",{"$f":"IF(H36=\"\",\"\",IF(H36*Formula!O36=0,\"\",H36*Formula!O36))","v":""},{"$f":"IF(H36=\"\",\"\",IF(H36*Formula!P36=0,\"\",H36*Formula!P36))","v":""},{"$f":"IF(H36=\"\",\"\",IF(H36*Formula!Q36=0,\"\",H36*Formula!Q36))","v":""},""]
[null,"SUM",{"$nulls":5},{"$f":"SUM(H6:H36)","v":{"v":0,"d":"0.000"}},{"$f":"SUM(I6:I35)","v":{"v":0,"d":"0.000"}},{"v":0,"d":"0.000"},{"v":0,"d":"0.000"},{"v":0,"d":"0.000"},{"v":0,"d":"0.000"},{"v":0,"d":"0.000"},{"v":0,"d":"0.000"},{"v":0,"d":"0.000"}]
[]
[]
[{"$nulls":8},"Requirements",null,null,{"$f":"L50","v":"R17"},null,"R19",{"$f":"O50","v":"R18"},{"$f":"P50","v":"R18"}]
[null,"For chemicals not on the DID-list and explanation for columns",{"$nulls":6},"Product type",null,null,{"$f":"L51","v":"∑ (H410)*100 + H411*10 + H412) (%)"},null,{"$f":"N51","v":"CDV-limit (chron)"},{"$f":"O51","v":"aNBO"},{"$f":"P51","v":"anNBO"}]
[null,"D & E  Lowest toxicity value / safety factor *",{"$nulls":6},"Foam soap",null,null,{"$f":"IF(P37<=L52+0.045,\"OK\",\"NO\")","v":"OK"},null,{"$f":"IFERROR(IF($L$37<=N52+0.45,\"OK\",\"NO\"),\"\")","v":"OK"},{"$f":"IFERROR(IF($J$37<=O52+0.045,\"OK\",\"NO\"),\"\")","v":"OK"},{"$f":"IFERROR(IF($K$37<=P52+0.045,\"OK\",\"NO\"),\"\")","v":"OK"}]
[null,"F  Degradability ** "]
[null,"I   Amount not aerobic biodegradable organic substance per functional unit (solution). If ingredient is not on DID-list; if ingredient is aerobic biodegradable fill in \"0\", if ingredient is not aerobic biodegradable copy amount from column (H)."]
[]
[null,"J  Amount not anaerobic biodegradable organic substance per functional unit (solution). If ingredient is not on DID-list; if ingredient is anaerobic biodegradable fill in \"0\", if ingredient is not anaerobic bio     degradable copy amount from column (H)."]
[]
[null,"* Lowest toxicity value (in all tested groups) / Safety factor 1000, 5000, 10000 for 3, 2, 1 tested organism groups."]
[null,"** Factor is 0,05 - 0,5 - 1 for readily biodegradable - inherently biodegradable - persistent (can be 0,15 for some surfactants)."]
[{"$nulls":8},"Limits",null,null,"R17",null,"R19","R18","R18"]
[null,"Exemptions",{"$nulls":6},"Product type",null,null,"∑ (H410)*100 + H411*10 + H412) (%)",null,"CDV-limit (chron)","aNBO","anNBO"]
[null,"Note that the following exceptions\n apply:",{"$nulls":6},"Foam soap",null,null,2.5,null,1000,2.5,2.5]
[null,"* Cumensulphonate (DID# 2540) – the data on the DID list does not agree with that published under the HERA project. \nThe following data on cumen-sulphonates can be used for application: aNBO = R and DF = 0.05. Since BCF = 1.41 and logKow = -2.7, cumensulphonates can in accordance with Appendix 2 be exempted from the calculation of anNBO."]

{"sheet":"DID-list 2016","index":4,"n_rows":284,"n_cols":12,"rows_kept":284,"merged":[[4,2,4,4],[4,5,4,7],[4,8,4,10]]}
[]
[]
["Detergents Ingredients Database, version 2016"]
[{"$nulls":9},"                                         "]
[null,null,"Acute toxicity",null,null,"Chronic toxicity",null,null,"Degradation"]
["DID-no","Ingredient name","LC50/ EC50 (*)","SF (*) (Acute)","TF    (Acute)","NOEC (*)","SF (*) (Chronic)","TF    (Chronic)","DF","Aerobic ","Anaerobic ","Leverandør erklæring modtaget (angiv licensnr + virksomhed)"]
[null,"Anionic surfactants"]
[2001,"C10-13 linear alkyl benzene sulphonates",4.1,1000,{"$f":"C8/D8","v":4.0999999999999995E-3},0.69,10,{"$f":"F8/G8","v":0.06899999999999999},0.05,"R","N"]
[2002,"C14-16 Alkyl sulphonate",6.7,5000,1.34E-3,0.5,10,0.05,0.05,"R","N"]
[2003,"C8-10 Alkyl sulphate",40,1000,0.04,1.35,10,{"$f":"F10/G10","v":0.135},0.05,"R","Y"]
[2004,"C10 Alkyl sulphate",8.64,1000,0.00864,0.95,10,{"$f":"F11/G11","v":0.095},0.05,"R","O"]
[2005,"C 12-14 Alkyl sulphate",2.8,1000,2.8E-3,0.391,10,{"$f":"F12/G12","v":0.0391},0.05,"R","Y"]
[2006,"C 12-18 Alkyl sulphate",15,1000,0.015,0.419,10,0.0419,0.05,"R","Y"]
[2007,"C 16-18 Alkyl sulphate",27,1000,0.027,0.2,10,{"$f":"F14/G14","v":0.02},0.05,"R","Y"]
[2008,"C8-12 Alkyl ether sulphate, even and odd-numbered, 1-3 EO",7.1,1000,7.0999999999999995E-3,1.9,50,{"$f":"F15/G15","v":0.038},0.05,"R","O"]
[2009,"C12-18 Alkyl ether sulphate, even and odd-numbered, 1-3 EO",4.6,1000,0.0046,0.14,10,{"$f":"F16/G16","v":0.014000000000000002},0.05,"R","Y"]
[2010,"C 16-18 Alkyl ether sulphate, ≥1 - ≤ 4 EO",0.57,10000,5.6999999999999996E-5,null,null,{"$f":"E17","v":5.6999999999999996E-5},0.05,"R","Y"]
[2011,"Mono-C12-14 Alkyl sulfosuccinate",18,1000,0.018,null,null,0.018,0.05,"R","O"]
[2012,"Mono-C12-18 Alkyl sulfosuccinate",2,1000,2E-3,null,null,2E-3,0.05,"R","O"]
[2013,"Mono-C16-18 Alkyl sulfosuccinate",0.73,1000,0.00073,null,null,0.00073,0.05,"R","O"]
[2014,"di-C4-6 Alkyl sulfosuccinate",100,1000,0.1,null,null,0.1,0.05,"R","O"]
[2015,"di-2-ethylhexyl sulfosuccinate",6.6,1000,6.6E-3,null,null,6.6E-3,0.05,"R","O"]
[2016,"di-iso C10 Alkyl sulfosuccinate",0.88,1000,0.00088,null,null,0.00088,0.05,"R","O"]
[2017,"di-iso C13 Alkyl sulfosuccinate",1.96,1000,0.00196,null,null,{"$f":"E24","v":0.00196},0.5,"I","O"]
[2018,"Alkylamino sulfosuccinates (even numbered)",10,1000,0.01,null,null,0.01,0.05,"R","O"]
[2019,"Alkylamino[ethyl] sulfosuccinates (even numbered)",6.1,1000,{"$f":"C26/D26","v":6.0999999999999995E-3},null,null,{"$f":"E26","v":6.0999999999999995E-3},0.05,"R","O"]
[2020,"Aspartic acid, N-(3-carboxy-1-oxo-sulfopropyl)-N-(C16-C18 (even numbered), C18 unsaturated alkyl) tetrasodium salts ",10,1000,0.01,null,null,{"$f":"E27","v":0.01},0.05,"R","O"]
[2021,"C12-14 Fatty acid methyl Ester Sulphonate",9,10000,0.0009,0.25,50,{"$f":"F28/G28","v":0.005},0.05,"R","N"]
[2022,"C16-18 Fatty acid methyl Ester Sulphonate",0.8065,1000,0.0008065,0.23,50,{"$f":"F29/G29","v":0.0046},0.05,"R","N"]
[2023,"C14-16 alfa olefin sulphonate",3.3,10000,{"$f":"C30/D30","v":3.3E-4},1.2,50,{"$f":"F30/G30","v":0.024},0.05,"R","N"]
[2024,"C14-18 alfa olefin sulphonate",0.5,5000,1E-4,null,null,{"$f":"E31","v":1E-4},0.05,"R","N"]
[2025,"Soap C>12-22 (Remark: fatty acids are listed in DID 2520)",22,1000,0.022,10,100,{"$f":"F32/G32","v":0.1},0.05,"R","Y"]
[2026,"Lauroyl Sarcosinate    ",56,10000,0.0056,null,null,{"$f":"E33","v":0.0056},0.05,"R","Y"]
[2027,"C9-11, ≥2 - ≤10 EO Carboxymethylated, sodium salt or acid",100,10000,0.01,null,null,{"$f":"E34","v":0.01},0.05,"R","O"]
[2028,"C12-18,   ≥2 - ≤10 EO Carboxymethylated, sodium salt or acid",8.8,1000,0.0088,5,100,{"$f":"F35/G35","v":0.05},0.05,"R","O"]
[2029,"C12-18 Alkyl phosphate esters",38,1000,0.038,null,null,{"$f":"E36","v":0.038},0.05,"R","N"]
[2030,"iso C13 Alkyl phosphate esters, 3 EO",0.1,1000,1E-4,0.32,100,{"$f":"F37/G37","v":0.0032},0.5,"I","O"]
[2031,"Sodium cocoyl glutamate",238,1000,0.238,null,null,0.238,0.05,"R","Y"]
[2032,"Sodium Lauroyl Methyl Isethionate",25.1,1000,{"$f":"C39/D39","v":0.0251},12.5,50,{"$f":"F39/G39","v":0.25},0.05,"R","Y"]
[]
[null,"Non-ionic surfactants (****)"]
[2107,"2-propylheptyl alcohol, >2.5 - ≤10 EO",37.3,5000,{"$f":"C42/D42","v":0.00746},1.5,10,{"$f":"F42/G42","v":0.15},0.05,"R","O"]
[2108,"C10 Alcohol, ≥ 5 - ≤11 EO multibranched(Trimer-propen-oxo-alcohol)",5,1000,0.005,1.5,10,0.15,0.05,"R","Y"]
[2112,"C12-14 Alcohol, ≥5 - ≤8 EO 1 t-BuO (endcapped)",0.23,1000,0.00023,0.18,100,{"$f":"F44/G44","v":1.8E-3},0.05,"R","O"]
[2113,"iso-C13 Alcohol, ≤ 2,5 EO",1,1000,1E-3,0.74,10,0.074,0.05,"R","O"]
[2114,"iso-C13 Alcohol, >2,5 - ≤6 EO",1,1000,1E-3,0.6,10,0.06,0.05,"R","O"]
[2115,"iso-C13 Alcohol, ≥7 - <20 EO",1,1000,1E-3,2.5,10,0.25,0.05,"R","O"]
[2130,"C12-15 Alcohol, ≥2 - ≤6 EO, ≥2 - ≤6 PO",0.78,1000,0.00078,0.36,100,0.0036,0.05,"R","O"]
[2131,"C10-16 Alcohol, 6 and 7 EO, ≤3 PO",3.2,5000,0.00064,1,100,0.01,0.05,"R","O"]
[2132,"C12-18 Alkyl glycerol ester (even numbered), 1-6,5 EO",10,1000,0.01,null,null,{"$f":"E50","v":0.01},0.05,"R","Y"]
[2133,"C12-18 Alkyl glycerol ester (even numbered), >6,5-17 EO",10,1000,0.01,6.25,50,0.125,0.05,"R","Y"]
[2134,"C4-10 Alkyl polyglucoside",28,1000,0.028,1.75,10,{"$f":"F52/G52","v":0.175},0.05,"R","Y"]
[2135,"C8-12 Alkyl polyglycoside, branched",480,1000,0.48,100,100,1,0.05,"R","N"]
[2136,"C 12-14 Alkyl polyglycoside",8.7,1000,0.0087,1.75,10,{"$f":"F54/G54","v":0.175},0.05,"R","Y"]
[2137,"C 16-18 Alkyl polyglycoside",null,null,{"$f":"H55","v":0.175},1.75,10,{"$f":"F55/G55","v":0.175},0.05,"R","O"]
[2138,"N1 C8-18 Alkanolamide (even numbered)",9.5,1000,{"$f":"C56/D56","v":0.0095},0.07,10,{"$f":"F56/G56","v":7.000000000000001E-3},0.05,"R","Y"]
[2139,"Coconut fatty acid monoethanolamide 4 and 5 EO   ",17,10000,0.0017,null,null,{"$f":"E57","v":0.0017},0.05,"R","Y"]
[2140,"N2 C8-18 Alkanolamide",2,1000,2E-3,0.07,10,{"$f":"F58/G58","v":7.000000000000001E-3},0.05,"R","Y"]
[2141,"PEG-4 Rapeseed amide",7,1000,0.007,null,null,{"$f":"E59","v":0.007},0.05,"R","Y"]
[2142,"Amines, coco, ≥10 - ≤15 EO",6.4,5000,0.00128,null,null,{"$f":"E60","v":0.00128},0.05,"R","O"]
[2143,"Amines, tallow, ≤2,5 EO",0.1,5000,2e-05,0.0107,50,2.14E-4,0.05,"R","O"]
[2144,"Amines, tallow, ≥5 - ≤11 EO",0.42,5000,8.4e-05,0.0107,50,{"$f":"F62/G62","v":2.14E-4},0.05,"R","O"]
[2146,"Amines, tallow, ≥20 - ≤50 EO",3.6,1000,0.0036,null,null,{"$f":"E63","v":0.0036},0.5,"I","O"]
[2147,"Amines, C18 saturated and unsaturated, ≤2,5 EO ",{"$f":"(0.295+0.41)/2","v":0.3525},10000,3.5249999999999996E-5,0.0044,50,{"$f":"F64/G64","v":8.8000000000000011E-5},0.05,"R","O"]
[2148,"Amines, C18 saturated and unsaturated, ≥5 - ≤15 EO ",0.01,1000,1e-05,null,null,{"$f":"E65","v":1e-05},0.05,"R","O"]
[2149,"Amines, C18 saturated and unsaturated, ≥20 - ≤25 EO",1,10000,1E-4,null,null,{"$f":"E66","v":1E-4},0.5,"I","O"]
[2150,"C12 sorbitan monoester, 20 EO (polysorbate 20)",100,1000,{"$f":"C67/D67","v":0.1},100,50,{"$f":"F67/G67","v":2},0.5,"I","O"]
[2151,"C18 sorbitan monoester, 20 EO",100,1000,{"$f":"C68/D68","v":0.1},null,null,{"$f":"E68","v":0.1},0.5,"I","O"]
[2152,"C8-10 Sorbitan mono- or diester",39,1000,{"$f":"C69/D69","v":0.039},3.2,50,{"$f":"+F69/G69","v":0.064},0.05,"R","Y"]
[2153,"Sorbitan stearate",100,1000,0.1,100,50,{"$f":"+F70/G70","v":2},0.05,"R","O"]
[2154,"C12-14 Fatty acid methyl ester (MEE), 1-30 EO",12.1,1000,0.0121,0.254,10,{"$f":"+F71/G71","v":0.0254},0.05,"R","Y"]
[2155,"C8-11 Alcohol, predominately linear, ≤2,5 EO",5,1000,0.005,1.5,10,{"$f":"F72/G72","v":0.15},0.05,"R","Y"]
[2156,"C8-11 Alcohol, predominately linear, >2,5 - ≤10 EO",5,1000,0.005,1.5,10,{"$f":"F73/G73","v":0.15},0.05,"R","Y"]
[2157,"C8-11 Alcohol, predominately linear, >10 EO",50,1000,0.05,25,10,2.5,0.05,"R","Y"]
[2158,"C9-11 Alcohol, branched, ≤2,5 EO",5,1000,0.005,1.5,10,{"$f":"F75/G75","v":0.15},0.05,"R","O"]
[2159,"C 9-11 Alcohol, branched, >2.5 - ≤10 EO",5,1000,0.005,1.5,10,0.15,0.05,"R","O"]
[2160,"C 9-11 Alcohol, branched, >10 EO",50,1000,0.05,25,10,2.5,0.05,"R","O"]
[2161,"C12-16 Alcohol, predominately linear, ≤2,5 EO",0.43,1000,0.00043,0.29,10,{"$f":"F78/G78","v":0.028999999999999998},0.05,"R","Y"]
[2162,"C12-16 Alcohol, predominately linear, >2,5 - ≤5 EO",0.43,1000,0.00043,0.37,10,0.037,0.05,"R","Y"]
[2163,"C12-16 Alcohol, predominately linear, >5 - ≤10 EO",0.4,1000,0.0004,0.27,10,0.027000000000000003,0.05,"R","Y"]
[2164,"C14-15 Alcohol, predominately linear, ≤ 2,5 EO",null,null,{"$f":"H81","v":0.01},0.1,10,0.01,0.05,"R","Y"]
[2165,"C14-15 Alcohol, predominately linear, >2,5 - ≤10 EO",0.4,1000,{"$f":"C82/D82","v":0.0004},0.12,10,0.012,0.05,"R","Y"]
[2166,"C12-16 Alcohol, predominately linear >10 - <20 EO",0.7,1000,0.0007,4.86,10,0.48600000000000004,0.05,"R","Y"]
[2167,"C12-16 Alcohol, predominately linear, >20 - <30 EO",13,1000,0.013,4.86,10,0.48600000000000004,0.05,"R","O "]
[2168,"C12-16 Alcohol, predominately linear, ≥30 EO",130,1000,0.13,56,10,5.6,0.05,"R","O"]
[2170,"C12-18 Alcohol, predominately linear, ≤2,5 EO",0.3,1000,0.0003,0.47,10,0.047,0.05,"R","Y"]
[2171,"C12-18 Alcohol, predominately linear, >2,5 - ≤5 EO",1,1000,1E-3,0.2,10,0.02,0.05,"R","O"]
[2172,"C12-18 Alcohol, predominately linear, >5 - ≤10 EO",1,1000,1E-3,0.39,10,0.039,0.05,"R","Y"]
[2173,"C12-18 Alcohol, predominately linear, > 10 EO",1,1000,1E-3,1.52,10,0.152,0.05,"R","O"]
[2174,"C16-18 Alcohol, predominately linear, ≤2,5 EO",null,null,{"$f":"H90","v":0.0054},0.054,10,0.0054,0.05,"R","O"]
[2175,"C16-18 Alcohol, predominately linear, >2,5 - ≤8 EO",3.2,1000,{"$f":"C91/D91","v":0.0032},0.082,10,0.0082,0.05,"R","Y"]
[2176,"C16-18 Alcohol, predominately linear, >9 - ≤19 EO",0.72,1000,{"$f":"C92/D92","v":7.1999999999999994E-4},0.11,10,0.011,0.05,"R","Y"]
[2177,"C16-18 Alcohol, predominately linear, ≥20 - ≤30 EO",4.1,1000,{"$f":"C93/D93","v":4.0999999999999995E-3},28.6,10,2.8600000000000003,0.05,"R","Y"]
[2178,"C16-18 Alcohol, predominately linear, >30 EO",30,1000,{"$f":"C94/D94","v":0.03},null,null,{"$f":"E94","v":0.03},0.05,"R","Y"]
[2179,"Amines, tallow, ≥12 - ≤19 EO",1.3,1000,0.0013,null,null,{"$f":"E95","v":0.0013},0.05,"R","O"]
[]
[null,"Amphoteric surfactants"]
[2201,"C12-15 Alkyl dimethyl betaine",1.7,1000,{"$f":"C98/D98","v":0.0017},0.135,10,{"$f":"F98/G98","v":0.013500000000000002},0.05,"R","Y"]
[2202,"C8-18 Alkyl amidopropylbetaines",0.925,1000,{"$f":"C99/D99","v":0.000925},0.135,10,{"$f":"F99/G99","v":0.013500000000000002},0.05,"R","Y"]
[2203,"C12-18 Alkyl amine oxide",0.3,1000,0.0003,null,null,{"$f":"E100","v":0.0003},0.05,"R","Y"]
[2204,"C12-14 Alkyl amidopropyl amine oxide",3.4,1000,0.0034,null,null,{"$f":"E101","v":0.0034},0.05,"R","O"]
[2205,"C12-18 Alkyl amidopropyl amine oxide",0.68,5000,1.36E-4,0.3,10,{"$f":"F102/G102","v":0.03},0.05,"R","O"]
[2206,"C10-18 Alkyl dimethyl amine oxide",0.134,1000,1.34E-4,0.067,10,{"$f":"F103/G103","v":0.0067},0.05,"R","O"]
[2207,"C8-18 Amphoacetates",{"$f":"(5.3+1.6)/2","v":3.45},1000,3.4500000000000004E-3,null,null,{"$f":"E104","v":3.4500000000000004E-3},0.05,"R","Y"]
[]
[null,"Cationic surfactants"]
[2301,"C8-16 alkyltrimethyl or benzyldimethyl quaternary ammonium salts",0.08,1000,{"$f":"C107/D107","v":8e-05},0.0068,10,{"$f":"F107/G107","v":6.7999999999999994E-4},0.05,"R","O"]
[2302,"C16-18 alkyl benzyldimethyl quaternary ammonium salts",0.05,1000,{"$f":"C108/D108","v":5e-05},0.025,10,{"$f":"F108/G108","v":0.0025},0.05,"R","O"]
[2303,"tri C16-18 Esterquats",1.91,1000,{"$f":"C109/D109","v":1.91E-3},1,10,{"$f":"F109/G109","v":0.1},0.05,"R","Y"]
[2304,"di C16-18 Esterquats",{"$nulls":3},0.69,50,{"$f":"F110/G110","v":0.0138},0.05,"R","O"]
[]
[]
[null,"Preservatives (****)"]
[2401,"1,2-Benzisothiazol-3-one (BIT)",0.11,1000,{"$f":"C114/D114","v":1.1E-4},0.04,10,{"$f":"F114/G114","v":0.004},0.5,"I","N"]
[2402,"Benzyl alcohol              ",295,1000,0.295,51,50,1.02,0.05,"R","Y"]
[2403,"5-bromo-5-nitro-1,3-dioxane",0.4,5000,{"$f":"C116/D116","v":8e-05},null,null,{"$f":"E116","v":8e-05},1,"P","O"]
[2404,"2-bromo-2-nitropropane-1,3-diol (Remark: Formaldehyde donor)",0.78,1000,0.00078,0.1,10,{"$f":"F117/G117","v":0.01},0.15,"R","O"]
[2405,"Chloroacetamide      ",4.81,1000,0.0048,null,null,0.0048,0.05,"R","O"]
[2406,"Diazolinidylurea         ",35,5000,0.007,null,null,{"$f":"E119","v":0.007},1,"P","O"]
[2407,"Formaldehyde               ",2,1000,2E-3,null,null,{"$f":"E120","v":2E-3},0.05,"R","O"]
[2408,"Glutaraldehyde         ",0.375,1000,0.000375,0.0223,10,{"$f":"F121/G121","v":0.00223},0.05,"R","O"]
[2410,"CMI + MI in mixture 3:1 (CAS 55965-84-9) (§)",0.048,1000,4.8e-05,0.0012,10,{"$f":"F122/G122","v":1.1999999999999999E-4},0.5,"I","O"]
[2411,"2-Methyl-2H-isothiazol-3-one (MI)",0.16,1000,0.00016,0.03,10,{"$f":"F123/G123","v":0.003},0.5,"I","O"]
[2412,"Methyldibromoglutaronitrile",0.15,1000,0.00015,null,null,{"$f":"E124","v":0.00015},0.05,"R","O"]
[2413,"Methyl-, Ethyl- and Propylparaben",15.4,5000,3.0800000000000003E-3,null,null,{"$f":"E125","v":3.0800000000000003E-3},0.05,"R","N"]
[2414,"o-Phenylphenol          ",1.1,1000,0.0011,0.009,10,{"$f":"F126/G126","v":0.0009},0.05,"R","O","Ja (506-140 Blumøller)"]
[2415,"Sodium benzoate          ",24.8,1000,0.0248,0.09,50,{"$f":"F127/G127","v":1.8E-3},0.05,"R","Y"]
[2416,"Sodium hydroxy methyl glycinate",36.5,5000,0.0073,null,null,{"$f":"E128","v":0.0073},1,"O","O"]
[2418,"Triclosan                   ",1.4E-3,1000,1.4e-06,0.00069,10,{"$f":"F129/G129","v":6.9e-05},0.5,"I","O"]
[2419,"Phenoxy-ethanol",291,1000,0.291,9.43,10,{"$f":"+F130/G130","v":0.943},0.05,"R","O"]
[2420,"Sorbate and sorbic acid",24.1,1000,{"$f":"C131/D131","v":0.0241},null,null,{"$f":"E131","v":0.0241},0.05,"R","O"]
[2421,"N-(3-Aminopropyl)-N-dodecylpropane-1,3-diamine",0.027,1000,{"$f":"C132/D132","v":2.7e-05},0.0085,50,{"$f":"F132/G132","v":0.00017},0.05,"R","O"]
[2422,"Phenoxypropanol",100,1000,{"$f":"C133/D133","v":0.1},null,null,0.1,0.05,"R","O"]
[]
[]
[]
[null,"Other ingredients (****)"]
[2502,"Paraffin (CAS 8002-74-2)                  ",100,1000,0.1,100,10,10,1,"P","O"]
[2503,"Glycerol, sorbitol and xylitol                  ",885,5000,{"$f":"C139/D139","v":0.177},null,null,{"$f":"E139","v":0.177},0.05,"R","Y"]
[2504,"Phosphate, as STPP   ",160,1000,0.16,null,null,0.16,0.05,"NA","NA"]
[2505,"Zeolite                   (Insoluble Inorganic)                       ",100,1000,{"$f":"C141/D141","v":0.1},100,50,{"$f":"F141/G141","v":2},1,"NA","NA","JA (526-115 Alpha)"]
[2506,"Citrate and citric acid                      ",825,1000,0.825,80,50,{"$f":"F142/G142","v":1.6},0.05,"R","Y"]
[2507,"Polycarboxylates homopolymer of acrylic acid                ",40,1000,0.04,12,10,{"$f":"F143/G143","v":1.2},1,"P","N"]
[2508,"Polycarboxylates copolymer of acrylic/maleic acid               ",100,1000,0.1,5.8,10,0.58,1,"P","N"]
[2509,"Nitrilotriacetat (NTA)",494,1000,0.494,64,50,1.28,0.05,"R","N"]
[2510,"GLDA",100,1000,0.1,100,10,10,0.05,"R","Y"]
[2511,"EDTA                        ",121,1000,0.121,22,50,0.44,0.5,"I","N"]
[2512,"Phosphonates             ",650,1000,0.65,25,50,0.5,1,"P","N"]
[2513,"EDDS                         ",5.5,1000,{"$f":"C149/D149","v":0.0055},0.66,10,0.066,0.05,"R","N"]
[2514,"Carboxymethyl inulin (CMI)",1000,1000,{"$f":"C150/D150","v":1},423,10,42.3,0.5,"I","N","Ja, Bilag 4 (517-044 Dalli)"]
[2515,"Clay                   (Insoluble Inorganic)          ",null,null,10,null,null,10,1,"NA","NA"]
[2516,"Carbonates                  ",null,null,10,null,null,10,0.05,"NA","NA"]
[2517,"Veg. Oil",100,1000,{"$f":"C153/D153","v":0.1},null,null,{"$f":"E153","v":0.1},0.05,"R","Y"]
[2518,"Veg. Oil (hydrogenated)",100,1000,0.1,null,null,0.1,0.05,"R","Y"]
[2519,"Lauric Acid (C12:0)",3.6,1000,0.0036,0.47,10,{"$f":"F155/G155","v":0.047},0.05,"R","O"]
[2520,"Fatty acids, C≥14-C≤22 (even numbered) (Remark: soap is listed in DID 2025)    ",100,1000,0.1,100,50,2,0.05,"R","Y"]
[2521,"Fatty acid, C≥6-C≤12 methyl ester",21,10000,{"$f":"C157/D157","v":0.0021},null,null,{"$f":"+E157","v":0.0021},0.05,"R","Y"]
[2522,"Lanolin",100,1000,{"$f":"C158/D158","v":0.1},null,null,{"$f":"E158","v":0.1},0.05,"R","O"]
[2523,"Soluble Silicates                   ",207,1000,{"$f":"C159/D159","v":0.207},null,null,{"$f":"E159","v":0.207},1,"NA","NA"]
[2524,"Polyasparaginic acid, Na-salt",410,1000,{"$f":"C160/D160","v":0.41},null,null,{"$f":"E160","v":0.41},0.05,"R","N"]
[2525,"Perborates (as Boron)",14,1000,0.014,null,null,0.014,1,"NA","NA"]
[2526,"Percarbonate",4.9,1000,{"$f":"C162/D162","v":0.004900000000000001},0.7,50,{"$f":"F162/G162","v":0.013999999999999999},0.01,"NA","NA"]
[2527,"H2O2",2.4,1000,{"$f":"C163/D163","v":0.0024},0.22,50,{"$f":"F163/G163","v":0.0044},0.01,"NA","NA"]
[2528,"Tetraacetylethylenediamine (TAED)",250,1000,{"$f":"C164/D164","v":0.25},500,50,10,0.05,"R","Y"]
[2529,"C1-C3 alcohols                ",1000,1000,1,null,null,{"$f":"E165","v":1},0.05,"R","Y"]
[2530,"Cetyl Alcohol and Cetearyl Alcohol",100,1000,0.1,100,50,{"$f":"F166/G166","v":2},0.05,"R","Y"]
[2531,"Mono-, di- and triethanol amine",90,1000,0.09,0.78,50,{"$f":"F167/G167","v":0.015600000000000001},0.05,"R","Y"]
[2532,"Polyvinylpyrrolidon (PVP)",1000,1000,1,null,null,{"$f":"E168","v":1},0.5,"I","N"]
[2533,"Carboxymethylcellulose (CMC)",250,5000,0.05,null,null,{"$f":"E169","v":0.05},0.5,"I","N"]
[2534,"Sodium and magnesium sulphate        ",null,null,10,null,null,10,0.05,"NA","NA"]
[2535,"Calcium- and sodium chloride ",null,null,10,null,null,10,1,"NA","NA"]
[2536,"Urea                          ",9100,5000,{"$f":"C172/D172","v":1.82},null,null,{"$f":"E172","v":1.82},0.5,"I","O"]
[2537,"Silicon dioxide, quartz          (Insoluble inorganic)",null,null,10,null,null,10,1,"NA","NA"]
[2538,"Polyethylene glycol, MW≥4100",1000,10000,{"$f":"C174/D174","v":0.1},null,null,{"$f":"E174","v":0.1},1,"P","N"]
[2539,"Polyethylene glycol, MW<4100",1000,10000,0.1,null,null,0.1,0.05,"R","Y"]
[2540,"Cumene sulphonates",450,1000,0.45,null,null,0.45,0.05,"R","O"]
[2541,"Xylene sulphonate",230,1000,0.23,31,100,{"$f":"F177/G177","v":0.31},0.15,"R","N"]
[2542,"Na-/Mg-/KOH         ",null,null,10,null,null,10,0.05,"NA","NA"]
[2543,"Ammonia",28,1000,0.028,0.05,10,{"$f":"F179/G179","v":0.005},0.05,"NA","NA"]
[2544,"Proteins except enzymes",25,5000,0.005,null,null,{"$f":"E180","v":0.005},0.05,"R","Y"]
[2545,"Proteinhydrolizates, wheatgluten",113,5000,{"$f":"C181/D181","v":{"v":0.0226,"d":"0.023"}},null,null,{"$f":"+E181","v":{"v":0.0226,"d":"0.023"}},0.05,"R","O"]
[2546,"Protease (active enzyme protein)",0.17,1000,{"$f":"C182/D182","v":0.00017},0.006,50,{"$f":"F182/G182","v":1.2E-4},0.01,"R","Y"]
[2547,"Non-protease (active enzyme protein)",18,1000,{"$f":"C183/D183","v":0.018},null,null,{"$f":"E183","v":0.018},0.01,"R","Y"]
[2548,"But-2-one (MEK)",1972,1000,{"$f":"C184/D184","v":1.972},null,null,{"$f":"+E184","v":1.972},0.05,"R","O"]
[2549,"Perfume, if not other specified (**)",2,1000,{"$f":"C185/D185","v":2E-3},null,null,{"$f":"E185","v":2E-3},0.5,"I","N"]
[2550,"Dyes, if not other specified (**)",10,1000,{"$f":"C186/D186","v":0.01},null,null,0.01,1,"P","N"]
[2551,"Polysaccarides including starch",100,1000,{"$f":"C187/D187","v":0.1},null,null,0.1,0.05,"R","Y"]
[2552,"Anionic polyester       ",655,1000,0.655,null,null,0.655,1,"P","O"]
[2553,"PVNO/PVPI                              ",530,1000,0.53,null,null,0.53,1,"P","N"]
[2554,"Zn Ftalocyanin sulphonate",0.2,1000,0.0002,0.16,100,{"$f":"F190/G190","v":0.0016},1,"P","N"]
[2555,"Iminodisuccinat ",81,1000,0.081,11.7,50,0.234,0.05,"R","N"]
[2556,"FWA 1                      ",100,1000,0.1,5.5,50,0.11,0.5,"I","N"]
[2557,"FWA 5                     ",10,1000,0.01,1,10,{"$f":"F193/G193","v":0.1},1,"P","N"]
[2558,"1-decanol                 ",4.225,1000,0.004225,0.11,50,{"$f":"F194/G194","v":0.0022},0.05,"R","O"]
[2559,"Methyl laurate          ",0.26,1000,{"$f":"C195/D195","v":2.6000000000000003E-4},0.0396,50,{"$f":"F195/G195","v":{"v":7.9200000000000006E-4,"d":"0.00079"}},0.05,"R","O"]
[2560,"Formic acid (Ca salt)",100,1000,0.1,null,null,{"$f":"E196","v":0.1},0.05,"R","Y"]
[2561,"Adipic acid               ",31,1000,0.031,null,null,0.031,0.05,"R","O"]
[2562,"Maleic acid               ",106,1000,0.106,null,null,0.106,0.05,"R","Y"]
[2563,"Malic acid                 ",106,1000,0.106,null,null,0.106,0.05,"R","O"]
[2564,"Tartaric acid            ",51,1000,0.051,null,null,0.051,0.05,"R","O","bilag 4 (526-131 Forchem)"]
[2565,"Phosphoric acid       ",138,1000,0.138,null,null,0.138,0.05,"NA","NA"]
[2566,"Oxalic acid               ",128,5000,0.0256,null,null,0.0256,0.05,"R","O"]
[2567,"Acetic acid               ",30,1000,0.03,null,null,0.03,0.05,"R","Y"]
[2568,"Lactic acid                ",130,1000,0.13,null,null,0.13,0.05,"R","Y"]
[2569,"Sulphamic acid           ",48,1000,{"$f":"C205/D205","v":0.048},null,null,{"$f":"E205","v":0.048},1,"NA","NA"]
[2570,"Salicylic acid            ",100,1000,0.1,10,50,0.2,0.05,"R","O"]
[2571,"Glycolic acid            ",31.2,1000,0.0312,null,null,{"$f":"E207","v":0.0312},0.05,"R","O"]
[2572,"Glutaric acid            ",208,5000,0.0416,null,null,0.0416,0.05,"R","O"]
[2573,"Malonic acid             ",95,5000,0.019,null,null,0.019,0.05,"R","O"]
[2574,"Ethylene glycol         ",6500,1000,6.5,null,null,6.5,0.05,"R","Y"]
[2575,"Ethylene glycol monobutyl ether",911,1000,0.911,88,10,{"$f":"F211/G211","v":8.8},0.05,"R","Y"]
[2576,"Diethylene glycol        ",4400,1000,{"$f":"C212/D212","v":4.4},100,10,{"$f":"F212/G212","v":10},0.05,"R","Y"]
[2577,"Diethylene glycol monomethyl ether",500,1000,{"$f":"C213/D213","v":0.5},null,null,{"$f":"E213","v":0.5},0.05,"R","O"]
[2578,"Diethylene glycol monoethyl ether",3940,5000,0.788,null,null,0.788,0.05,"R","O","Ja (506-149 Dalli)"]
[2579,"Diethylene glycol monobutyl ether",1254,1000,1.254,null,null,1.254,0.05,"R","O","Ja (506-149 Dalli)"]
[2580,"Diethylene glycol dimethylether",943,1000,0.943,320,50,{"$f":"F216/G216","v":6.4},0.5,"I","O"]
[2581,"Propylene glycol       ",32000,1000,32,null,null,{"$f":"E217","v":32},0.05,"R","Y"]
[2582,"Propylene glycol monomethyl ether",500,1000,0.5,null,null,{"$f":"E218","v":0.5},0.05,"R","O"]
[2583,"Propylene glycol monobutylether",{"v":762.5,"d":"763"},1000,{"v":0.7625,"d":"0.76"},null,null,{"$f":"E219","v":{"v":0.7625,"d":"0.76"}},0.05,"R","O"]
[2584,"Dipropylene glycol     ",109,1000,0.109,172.5,50,{"$f":"F220/G220","v":3.45},0.05,"R","O"]
[2585,"Dipropylene glycol monomethyl ether",969,1000,0.969,0.5,50,{"$f":"F221/G221","v":0.01},0.05,"R","O"]
[2586,"Dipropylene glycol monobutylether",841,1000,0.841,null,null,0.841,0.05,"R","O"]
[2587,"Dipropylene glycol dimethylether",1000,5000,0.2,null,null,0.2,0.5,"I","O"]
[2588,"Triethylene glycol      ",4400,1000,4.4,null,null,4.4,0.5,"I","O"]
[2589,"Tall oil                      ",1.8,1000,1.8E-3,null,null,1.8E-3,0.05,"R","O"]
[2590,"Ethylenebisstearamides",100,5000,0.02,null,null,0.02,0.5,"I","O"]
[2591,"Sodium gluconate      ",10000,10000,1,null,null,1,0.05,"R","O"]
[2592,"Glycol distearate       ",100,1000,{"$f":"C228/D228","v":0.1},100,50,{"$f":"F228/G228","v":2},0.05,"R","Y"]
[2593,"Hydroxyl ethyl cellulose",209,5000,0.0418,null,null,0.0418,1,"P","O"]
[2594,"Hydroxypropyl methyl cellulose",188,5000,0.0376,null,null,0.0376,1,"P","O"]
[2595,"1-methyl-2-pyrrolidone",600,1000,{"$f":"C231/D231","v":0.6},12.5,50,{"$f":"F231/G231","v":0.25},0.05,"R","O"]
[2596,"Xanthan gum             ",490,1000,0.49,null,null,0.49,0.05,"R","O"]
[2597,"Trimethyl pentanediol mono-isobutyrate",18,1000,0.018,3.3,100,{"$f":"F233/G233","v":0.033},0.05,"R","O"]
[2598,"Benzotriazole           ",75,1000,{"$f":"C234/D234","v":0.075},5.6,50,{"$f":"F234/G234","v":0.11199999999999999},1,"P","O"]
[2599,"Piperidinol-propanetricarboxylate salt",100,1000,0.1,120,100,{"$f":"F235/G235","v":1.2},0.5,"I","O"]
[2600,"Diethylaminopropyl-DAS",120,1000,0.12,120,100,{"$f":"F236/G236","v":1.2},1,"P","O"]
[2601,"Methylbenzamide-DAS",120,1000,0.12,120,100,{"$f":"F237/G237","v":1.2},0.5,"I","O"]
[2602,"Pentaerythritol-tetrakis-phenol-propionate",38,1000,0.038,null,null,{"$f":"E238","v":0.038},1,"P","O"]
[2603,"Block polymers ***     ",100,5000,0.02,null,null,0.02,1,"P","N"]
[2604,"Denatonium benzoate",13,5000,{"$f":"C240/D240","v":0.0026},null,null,0.0026,1,"O","O"]
[2605,"Succinate                   ",40.7,1000,{"$f":"C241/D241","v":0.0407},null,null,{"$f":"E241","v":0.0407},0.05,"R","O"]
[2606,"Polyaspartic acid          ",528,1000,{"$f":"C242/D242","v":0.528},null,null,0.528,0.05,"R","N"]
[2607,"Mn-saltren (CAS 61007-89-4)",39,1000,0.039,4.3,100,{"$f":"+F243/G243","v":0.043},0.5,"I","O"]
[2608,"Tri-sodium methylglycine diacetat",100,1000,0.1,100,10,{"$f":"+F244/G244","v":10},0.05,"R","Y"]
[2609,"Tocopherol acetate",100,1000,0.1,100,50,{"$f":"F245/G245","v":2},1,"P","O"]
[2610,"Ethylhexyl salicylate",100,1000,0.1,null,null,0.1,0.05,"R","O"]
[2611,"Ethylhexyl triazone",100,1000,0.1,null,null,0.1,1,"P","O"]
[2612,"Octocrilene",100,1000,0.1,null,null,0.1,1,"P","O"]
[2613,"Bis-ethylhexyloxyphenol methoxyphenyl triazine",100,1000,0.1,null,null,0.1,1,"P","O"]
[2614,"Butyl methoxydibenzoylmethane",100,1000,0.1,null,null,0.1,1,"P","O"]
[2615,"e-phthaloimidoperoxyhexanoic acid",0.59,5000,1.18E-4,null,null,{"$f":"E251","v":1.18E-4},0.05,"R","O"]
[2616,"Methanesulphonic acid",7.4,1000,0.0074,null,null,0.0074,0.05,"R","O"]
[2617,"Aloe vera",100,5000,0.02,null,null,0.02,0.05,"R","O"]
[2618,"Panthenol",100,1000,0.1,null,null,0.1,0.05,"R","O"]
[2619,"Caprylyl glycol",2.2,1000,0.0022,null,null,0.0022,0.05,"R","Y"]
[2620,"Glycerides, C14-18 and C16-18-unsatd. mono-, di- and tri-",100,1000,0.1,100,50,{"$f":"+F256/G256","v":2},0.05,"R","O"]
[2621,"Linear polydimethylsiloxanes",100,1000,{"$f":"C257/D257","v":0.1},null,null,{"$f":"E257","v":0.1},1,"P","N"]
[]
[]
["Insoluble inorganic  - Inorganic ingredient with very low, or no ability to dissolve in water."]
["(*)","If no acceptable toxicity data was found, these columns are empty. In that case TF(chronic) is defined as equal to TF(acute) and vice versa"]
["(**)","As a general rule licence applicants must use the data on the list. Perfumes and dyes are exceptions. If toxicity data is submitted by the licence "]
[null,"applicant the submitted data shall be used to calculate the TF and determine the degradability. If not, the values on the list shall be used. "]
["(***) ","The applicants data on aerobic degradability of DID no. 2603 Block polymers will be accepted after presentation of test-report."]
["(****)","If you have used previous versions of the DID-list (2007 or 2014), please note that some DID-list numbers no longer match in the 2016-version. "]
[null,"Some substances have been removed and others have got a new substance description and therefore assigned a new DID-number."]
["(§) ","5-Chloro-2-Methyl-4-isothiazolin-3-one and 2-Methyl-4-isothiazolin-3-one in mixture 3:1"]
["List of abbreviations:"]
["SF(acute) ","Safety factor for acute toxicity."]
["TF(acute) ","Toxicity factor based on acute toxicity on aquatic organisms."]
["SF(chronic) ","Safety factor for chronic toxicity."]
["TF(chronic) ","Toxicity factor based on chronic toxicity on aquatic organisms."]
["DF ","Degradation factor."]
["Aerobic degradation:"]
["R ","Readily biodegradable according to OECD guidelines."]
["I"," Inherently biodegradable according to OECD guidelines."]
["P ","Persistent. The ingredient has failed the test for inherent biodegradability."]
["O ","The ingredient has not been tested."]
["NA ","Not applicable"]
["Anaerobic degradation:"]
["Y ","Biodegradable under anaerobic conditions."]
["N ","Not biodegradable under anaerobic conditions."]
["O ","The ingredient has not been tested."]
["NA ","Not applicable"]

{"sheet":"DID-list 2023","index":5,"n_rows":308,"n_cols":11,"rows_kept":308,"merged":[[4,2,4,4],[4,5,4,7],[4,8,4,10]]}
[]
[]
["Detergents Ingredients Database, version 2023"]
[{"$nulls":9},"                                         "]
[null,null,"Acute toxicity",null,null,"Chronic toxicity",null,null,"Degradation"]
["DID-no","Ingredient name","LC50/ EC50 (*)","SF (*) (Acute)","TF    (Acute)","NOEC (*)","SF (*) (Chronic)","TF    (Chronic)","DF","Aerobic ","Anaerobic "]
[null,"Anionic surfactants"]
[2001,"C10-13 linear alkyl benzene sulphonates",4.1,1000,{"$f":"C8/D8","v":4.0999999999999995E-3},0.69,10,{"$f":"F8/G8","v":0.06899999999999999},0.05,"R","N"]
[2002,"C14-16 Alkyl sulphonate",6.7,5000,{"$f":"C9/D9","v":1.34E-3},0.5,10,{"$f":"F9/G9","v":0.05},0.05,"R","N"]
[2003,"C8-10 Alkyl sulphate",40,1000,{"$f":"C10/D10","v":0.04},1.35,10,{"$f":"F10/G10","v":0.135},0.05,"R","Y"]
[2004,"C10 Alkyl sulphate",8.64,1000,{"$f":"C11/D11","v":0.00864},0.95,10,{"$f":"F11/G11","v":0.095},0.05,"R","O"]
[2005,"C 12-14 Alkyl sulphate",2.8,1000,{"$f":"C12/D12","v":2.8E-3},0.391,10,{"$f":"F12/G12","v":0.0391},0.05,"R","Y"]
[2006,"C 12-18 Alkyl sulphate",15,1000,{"$f":"C13/D13","v":0.015},0.419,10,{"$f":"F13/G13","v":0.0419},0.05,"R","Y"]
[2007,"C 16-18 Alkyl sulphate",27,1000,{"$f":"C14/D14","v":0.027},0.2,10,{"$f":"F14/G14","v":0.02},0.05,"R","Y"]
[2008,"C8-12 Alkyl ether sulphate, even and odd-numbered, 1-3 EO",7.1,1000,{"$f":"C15/D15","v":7.0999999999999995E-3},1.9,50,{"$f":"F15/G15","v":0.038},0.05,"R","O"]
[2009,"C12-18 Alkyl ether sulphate, even and odd-numbered, 1-3 EO",4.6,1000,{"$f":"C16/D16","v":0.0046},0.14,10,{"$f":"F16/G16","v":0.014000000000000002},0.05,"R","Y"]
[2010,"C16-18 Alkyl ether sulphate, ≥1 - ≤ 4 EO",0.386,1000,{"$f":"C17/D17","v":3.86E-4},null,null,{"$f":"E17","v":3.86E-4},0.05,"R","Y"]
[2011,"Mono-C12-14 Alkyl sulfosuccinate",18,1000,{"$f":"C18/D18","v":0.018},null,null,{"$f":"E18","v":0.018},0.05,"R","O"]
[2012,"Mono-C12-18 Alkyl sulfosuccinate",2,1000,{"$f":"C19/D19","v":2E-3},null,null,{"$f":"E19","v":2E-3},0.05,"R","O"]
[2013,"Mono-C16-18 Alkyl sulfosuccinate",0.73,1000,{"$f":"C20/D20","v":0.00073},null,null,{"$f":"E20","v":0.00073},0.05,"R","O"]
[2014,"di-C4-6 Alkyl sulfosuccinate",100,1000,{"$f":"C21/D21","v":0.1},null,null,{"$f":"E21","v":0.1},0.05,"R","O"]
[2015,"di-2-ethylhexyl sulfosuccinate",6.6,1000,{"$f":"C22/D22","v":6.6E-3},null,null,{"$f":"E22","v":6.6E-3},0.05,"R","Y"]
[2016,"di-iso C10 Alkyl sulfosuccinate",0.88,1000,{"$f":"C23/D23","v":0.00088},null,null,{"$f":"E23","v":0.00088},0.05,"R","O"]
[2017,"di-iso C13 Alkyl sulfosuccinate",1.96,1000,{"$f":"C24/D24","v":0.00196},null,null,{"$f":"E24","v":0.00196},0.5,"I","O"]
[2018,"Alkylamino sulfosuccinates (even numbered)",10,1000,0.01,null,null,0.01,0.05,"R","O"]
[2019,"Alkylamino[ethyl] sulfosuccinates (even numbered)",6.1,1000,{"$f":"C26/D26","v":6.0999999999999995E-3},null,null,{"$f":"E26","v":6.0999999999999995E-3},0.05,"R","O"]
[2020,"Aspartic acid, N-(3-carboxy-1-oxo-sulfopropyl)-N-(C16-C18 (even numbered), C18 unsaturated alkyl) tetrasodium salts ",10,1000,{"$f":"C27/D27","v":0.01},null,null,{"$f":"E27","v":0.01},0.05,"R","O"]
[2021,"C12-14 Fatty acid methyl Ester Sulphonate",9,10000,{"$f":"C28/D28","v":0.0009},0.25,50,{"$f":"F28/G28","v":0.005},0.05,"R","N"]
[2022,"C16-18 Fatty acid methyl Ester Sulphonate",0.8065,1000,{"$f":"C29/D29","v":0.0008065},0.23,50,{"$f":"F29/G29","v":0.0046},0.05,"R","N"]
[2023,"C14-16 alfa olefin sulphonate",3.3,10000,{"$f":"C30/D30","v":3.3E-4},1.2,50,{"$f":"F30/G30","v":0.024},0.05,"R","N"]
[2024,"C14-18 alfa olefin sulphonate",0.5,5000,{"$f":"C31/D31","v":1E-4},null,null,{"$f":"E31","v":1E-4},0.05,"R","N"]
[2025,"Soap C12-22 (Remark: fatty acids are listed in DID 2520)",22,1000,{"$f":"C32/D32","v":0.022},10,100,{"$f":"F32/G32","v":0.1},0.05,"R","Y"]
[2026,"Lauroyl Sarcosinate    ",56,10000,{"$f":"C33/D33","v":0.0056},null,null,{"$f":"E33","v":0.0056},0.05,"R","Y"]
[2027,"C9-11, ≥2 - ≤10 EO Carboxymethylated, sodium salt or acid",100,10000,{"$f":"C34/D34","v":0.01},null,null,{"$f":"E34","v":0.01},0.05,"R","O"]
[2028,"C12-18, ≥2 - ≤10 EO Carboxymethylated, sodium salt or acid",8.8,1000,{"$f":"C35/D35","v":0.0088},5,100,{"$f":"F35/G35","v":0.05},0.05,"R","O"]
[2029,"C12-18 Alkyl phosphate esters",38,1000,{"$f":"C36/D36","v":0.038},null,null,{"$f":"E36","v":0.038},0.05,"R","N"]
[2030,"iso C13 Alkyl phosphate esters, 3 EO",0.1,1000,{"$f":"C37/D37","v":1E-4},0.32,100,{"$f":"F37/G37","v":0.0032},0.5,"I","O"]
[2031,"Sodium cocoyl glutamate",238,1000,{"$f":"C38/D38","v":0.238},null,null,{"$f":"E38","v":0.238},0.05,"R","Y"]
[2032,"Sodium Lauroyl Methyl Isethionate",25.1,1000,{"$f":"C39/D39","v":0.0251},12.5,50,{"$f":"F39/G39","v":0.25},0.05,"R","Y"]
[]
[null,"Non-ionic surfactants"]
[2107,"2-propylheptyl alcohol, >2.5 - ≤10 EO",37.3,5000,{"$f":"C42/D42","v":0.00746},1.5,10,{"$f":"F42/G42","v":0.15},0.05,"R","O"]
[2108,"C10 Alcohol, ≥ 5 - ≤11 EO multibranched(Trimer-propen-oxo-alcohol)",5,1000,{"$f":"C43/D43","v":0.005},1.5,10,0.15,0.05,"R","Y"]
[2112,"C12-14 Alcohol, ≥5 - ≤8 EO 1 t-BuO (endcapped)",0.23,1000,{"$f":"C44/D44","v":0.00023},0.18,100,{"$f":"F44/G44","v":1.8E-3},0.05,"R","O"]
[2113,"iso-C13 Alcohol, ≤ 2,5 EO",1,1000,{"$f":"C45/D45","v":1E-3},0.74,10,{"$f":"F45/G45","v":0.074},0.05,"R","O"]
[2114,"iso-C13 Alcohol, >2,5 - ≤6 EO",1,1000,{"$f":"C46/D46","v":1E-3},0.6,10,{"$f":"F46/G46","v":0.06},0.05,"R","O"]
[2115,"iso-C13 Alcohol, ≥7 - <20 EO",1,1000,{"$f":"C47/D47","v":1E-3},2.5,10,{"$f":"F47/G47","v":0.25},0.05,"R","O"]
[2130,"C12-15 Alcohol, ≥2 - ≤6 EO, ≥2 - ≤6 PO",0.78,1000,{"$f":"C48/D48","v":0.00078},0.36,100,{"$f":"F48/G48","v":0.0036},0.05,"R","O"]
[2131,"C10-16 Alcohol, 6 and 7 EO, ≤3 PO",3.2,5000,{"$f":"C49/D49","v":0.00064},1,100,{"$f":"F49/G49","v":0.01},0.05,"R","O"]
[2132,"C12-18 Alkyl glycerol ester (even numbered), 1-6,5 EO",10,1000,{"$f":"C50/D50","v":0.01},null,null,{"$f":"E50","v":0.01},0.05,"R","Y"]
[2133,"C12-18 Alkyl glycerol ester (even numbered), >6,5-17 EO",10,1000,{"$f":"C51/D51","v":0.01},6.25,50,0.125,0.05,"R","Y"]
[2134,"C4-10 Alkyl polyglucoside",28,1000,{"$f":"C52/D52","v":0.028},1.75,10,{"$f":"F52/G52","v":0.175},0.05,"R","Y"]
[2135,"C8-12 Alkyl polyglycoside, branched",480,1000,{"$f":"C53/D53","v":0.48},100,100,{"$f":"F53/G53","v":1},0.05,"R","N"]
[2136,"C12-14 Alkyl polyglycoside",8.7,1000,{"$f":"C54/D54","v":0.0087},1.75,10,{"$f":"F54/G54","v":0.175},0.05,"R","Y"]
[2137,"C16-18 Alkyl polyglycoside",null,null,{"$f":"H55","v":0.175},1.75,10,{"$f":"F55/G55","v":0.175},0.05,"R","O"]
[2138,"N1 C8-18 Alkanolamide (even numbered)",9.5,1000,{"$f":"C56/D56","v":0.0095},0.07,10,{"$f":"F56/G56","v":7.000000000000001E-3},0.05,"R","Y"]
[2139,"Coconut fatty acid monoethanolamide 4 and 5 EO   ",17,10000,{"$f":"C57/D57","v":0.0017},null,null,{"$f":"E57","v":0.0017},0.05,"R","Y"]
[2140,"N2 C8-18 Alkanolamide",2,1000,{"$f":"C58/D58","v":2E-3},0.07,10,{"$f":"F58/G58","v":7.000000000000001E-3},0.05,"R","Y"]
[2141,"PEG-4 Rapeseed amide",7,1000,{"$f":"C59/D59","v":0.007},null,null,{"$f":"E59","v":0.007},0.05,"R","Y"]
[2142,"Amines, coco, ≥10 - ≤15 EO",6.4,5000,{"$f":"C60/D60","v":0.00128},null,null,{"$f":"E60","v":0.00128},0.05,"R","O"]
[2143,"Amines, tallow, ≤2,5 EO",0.1,5000,{"$f":"C61/D61","v":2e-05},0.0107,50,2.14E-4,0.05,"R","O"]
[2144,"Amines, tallow, ≥5 - ≤11 EO",0.42,5000,{"$f":"C62/D62","v":8.4e-05},0.0107,50,{"$f":"F62/G62","v":2.14E-4},0.05,"R","O"]
[2146,"Amines, tallow, ≥20 - ≤50 EO",3.6,1000,{"$f":"C63/D63","v":0.0036},null,null,{"$f":"E63","v":0.0036},0.5,"I","O"]
[2147,"Amines, C18 saturated and unsaturated, ≤2,5 EO ",{"$f":"(0.295+0.41)/2","v":0.3525},10000,{"$f":"C64/D64","v":3.5249999999999996E-5},0.0044,50,{"$f":"F64/G64","v":8.8000000000000011E-5},0.05,"R","O"]
[2148,"Amines, C18 saturated and unsaturated, ≥5 - ≤15 EO ",0.01,1000,{"$f":"C65/D65","v":1e-05},null,null,{"$f":"E65","v":1e-05},0.05,"R","O"]
[2149,"Amines, C18 saturated and unsaturated, ≥20 - ≤25 EO",1,10000,{"$f":"C66/D66","v":1E-4},null,null,{"$f":"E66","v":1E-4},0.5,"I","O"]
[2150,"C12 sorbitan monoester, 20 EO (polysorbate 20)",100,1000,{"$f":"C67/D67","v":0.1},100,50,{"$f":"F67/G67","v":2},0.05,"R","O"]
[2151,"C18 sorbitan monoester, 20 EO",100,1000,{"$f":"C68/D68","v":0.1},null,null,{"$f":"E68","v":0.1},0.5,"I","O"]
[2152,"C8-10 Sorbitan mono- or diester",39,1000,{"$f":"C69/D69","v":0.039},3.2,50,{"$f":"+F69/G69","v":0.064},0.05,"R","Y"]
[2153,"Sorbitan stearate",100,1000,{"$f":"C70/D70","v":0.1},100,50,{"$f":"+F70/G70","v":2},0.05,"R","O"]
[2154,"C12-14 Fatty acid methyl ester (MEE), 1-30 EO",12.1,1000,{"$f":"C71/D71","v":0.0121},0.254,10,{"$f":"+F71/G71","v":0.0254},0.05,"R","Y"]
[2155,"C8-11 Alcohol, predominately linear, ≤2,5 EO",5,1000,{"$f":"C72/D72","v":0.005},1.5,10,{"$f":"F72/G72","v":0.15},0.05,"R","Y"]
[2156,"C8-11 Alcohol, predominately linear, >2,5 - ≤10 EO",5,1000,{"$f":"C73/D73","v":0.005},1.5,10,{"$f":"F73/G73","v":0.15},0.05,"R","Y"]
[2157,"C8-11 Alcohol, predominately linear, >10 EO",50,1000,{"$f":"C74/D74","v":0.05},25,10,{"$f":"F74/G74","v":2.5},0.05,"R","Y"]
[2158,"C9-11 Alcohol, branched, ≤2,5 EO",5,1000,{"$f":"C75/D75","v":0.005},1.5,10,{"$f":"F75/G75","v":0.15},0.05,"R","O"]
[2159,"C 9-11 Alcohol, branched, >2.5 - ≤10 EO",5,1000,{"$f":"C76/D76","v":0.005},1.5,10,0.15,0.05,"R","O"]
[2160,"C 9-11 Alcohol, branched, >10 EO",50,1000,{"$f":"C77/D77","v":0.05},25,10,2.5,0.05,"R","O"]
[2161,"C12-16 Alcohol, predominately linear, ≤2,5 EO",0.43,1000,{"$f":"C78/D78","v":0.00043},0.29,10,{"$f":"F78/G78","v":0.028999999999999998},0.05,"R","Y"]
[2162,"C12-16 Alcohol, predominately linear, >2,5 - ≤5 EO",0.43,1000,{"$f":"C79/D79","v":0.00043},0.37,10,{"$f":"F79/G79","v":0.037},0.05,"R","Y"]
[2163,"C12-16 Alcohol, predominately linear, >5 - ≤10 EO",0.4,1000,{"$f":"C80/D80","v":0.0004},0.27,10,{"$f":"F80/G80","v":0.027000000000000003},0.05,"R","Y"]
[2164,"C14-15 Alcohol, predominately linear, ≤ 2,5 EO",null,null,{"$f":"H81","v":0.01},0.1,10,{"$f":"F81/G81","v":0.01},0.05,"R","Y"]
[2165,"C14-15 Alcohol, predominately linear, >2,5 - ≤10 EO",0.4,1000,{"$f":"C82/D82","v":0.0004},0.12,10,{"$f":"F82/G82","v":0.012},0.05,"R","Y"]
[2166,"C12-16 Alcohol, predominately linear >10 - <20 EO",0.7,1000,{"$f":"C83/D83","v":0.0007},4.86,10,{"$f":"F83/G83","v":0.48600000000000004},0.05,"R","Y"]
[2167,"C12-16 Alcohol, predominately linear, >20 - <30 EO",13,1000,{"$f":"C84/D84","v":0.013},4.86,10,{"$f":"F84/G84","v":0.48600000000000004},0.05,"R","O"]
[2168,"C12-16 Alcohol, predominately linear, ≥30 EO",130,1000,{"$f":"C85/D85","v":0.13},56,10,{"$f":"F85/G85","v":5.6},0.05,"R","O"]
[2170,"C12-18 Alcohol, predominately linear, ≤2,5 EO",0.3,1000,{"$f":"C86/D86","v":0.0003},0.47,10,{"$f":"F86/G86","v":0.047},0.05,"R","Y"]
[2171,"C12-18 Alcohol, predominately linear, >2,5 - ≤5 EO",1,1000,{"$f":"C87/D87","v":1E-3},0.2,10,{"$f":"F87/G87","v":0.02},0.05,"R","O"]
[2172,"C12-18 Alcohol, predominately linear, >5 - ≤10 EO",1,1000,{"$f":"C88/D88","v":1E-3},0.39,10,{"$f":"F88/G88","v":0.039},0.05,"R","Y"]
[2173,"C12-18 Alcohol, predominately linear, > 10 EO",1,1000,{"$f":"C89/D89","v":1E-3},1.52,10,{"$f":"F89/G89","v":0.152},0.05,"R","O"]
[2174,"C16-18 Alcohol, predominately linear, ≤2,5 EO",null,null,{"$f":"H90","v":0.0054},0.054,10,{"$f":"F90/G90","v":0.0054},0.05,"R","Y"]
[2175,"C16-18 Alcohol, predominately linear, >2,5 - ≤8 EO",3.2,1000,{"$f":"C91/D91","v":0.0032},0.082,10,{"$f":"F91/G91","v":0.0082},0.05,"R","Y"]
[2176,"C16-18 Alcohol, predominately linear, >9 - ≤19 EO",0.72,1000,{"$f":"C92/D92","v":7.1999999999999994E-4},0.11,10,{"$f":"F92/G92","v":0.011},0.05,"R","Y"]
[2177,"C16-18 Alcohol, predominately linear, ≥20 - ≤30 EO",4.1,1000,{"$f":"C93/D93","v":4.0999999999999995E-3},28.6,10,{"$f":"F93/G93","v":2.8600000000000003},0.05,"R","Y"]
[2178,"C16-18 Alcohol, predominately linear, >30 EO",30,1000,{"$f":"C94/D94","v":0.03},null,null,{"$f":"E94","v":0.03},0.05,"R","Y"]
[2179,"Amines, tallow, ≥12 - ≤19 EO",1.3,1000,{"$f":"C95/D95","v":0.0013},null,null,{"$f":"E95","v":0.0013},0.05,"R","O"]
[2180,"Glyceryl caprylate",0.449,1000,0.000449,null,null,0.000449,0.05,"R","O"]
[2181,"C10-16 Alkyl polyglycoside (even numbered)",2.95,1000,2.9500000000000004E-3,1.76,50,0.0352,0.05,"R","O"]
[]
[null,"Amphoteric surfactants"]
[2201,"C12-15 Alkyl dimethyl betaine",1.7,1000,{"$f":"C100/D100","v":0.0017},0.135,10,{"$f":"F100/G100","v":0.013500000000000002},0.05,"R","Y"]
[2202,"C8-18 Alkyl amidopropylbetaines",0.925,1000,{"$f":"C101/D101","v":0.000925},0.135,10,{"$f":"F101/G101","v":0.013500000000000002},0.05,"R","Y"]
[2203,"C12-18 Alkyl amine oxide",0.3,1000,{"$f":"C102/D102","v":0.0003},null,null,{"$f":"E102","v":0.0003},0.05,"R","Y"]
[2204,"C12-14 Alkyl amidopropyl amine oxide",3.4,1000,{"$f":"C103/D103","v":0.0034},null,null,{"$f":"E103","v":0.0034},0.05,"R","Y"]
[2205,"C12-18 Alkyl amidopropyl amine oxide",0.68,5000,{"$f":"C104/D104","v":1.36E-4},0.3,10,{"$f":"F104/G104","v":0.03},0.05,"R","Y"]
[2206,"C10-18 Alkyl dimethyl amine oxide",0.134,1000,{"$f":"C105/D105","v":1.34E-4},0.067,10,{"$f":"F105/G105","v":0.0067},0.05,"R","Y"]
[2207,"C8-18 Amphoacetates",{"$f":"(5.3+1.6)/2","v":3.45},1000,{"$f":"C106/D106","v":3.4500000000000004E-3},null,null,{"$f":"E106","v":3.4500000000000004E-3},0.05,"R","Y"]
[2208,"Behanamidopropyl dimethylamine",1.16,1000,{"$f":"C107/D107","v":1.16E-3},null,null,{"$f":"E107","v":1.16E-3},0.05,"R","Y"]
[]
[null,"Cationic surfactants"]
[2301,"C8-16 alkyltrimethyl or benzyldimethyl quaternary ammonium salts",0.08,1000,{"$f":"C110/D110","v":8e-05},0.0068,10,{"$f":"F110/G110","v":6.7999999999999994E-4},0.05,"R","O"]
[2302,"C16-18 alkyl benzyldimethyl quaternary ammonium salts",0.05,1000,{"$f":"C111/D111","v":5e-05},0.025,10,{"$f":"F111/G111","v":0.0025},0.05,"R","O"]
[2303,"tri C16-18 Esterquats",1.91,1000,{"$f":"C112/D112","v":1.91E-3},1,10,{"$f":"F112/G112","v":0.1},0.05,"R","Y"]
[2304,"di C16-18 Esterquats",{"$nulls":3},0.69,50,{"$f":"F113/G113","v":0.0138},0.05,"R","Y"]
[]
[null,"Preservatives"]
[2401,"1,2-Benzisothiazol-3-one (BIT)",0.11,1000,{"$f":"C116/D116","v":1.1E-4},0.04,10,{"$f":"F116/G116","v":0.004},0.5,"I","N"]
[2402,"Benzyl alcohol              ",295,1000,0.295,51,50,1.02,0.05,"R","Y"]
[2403,"5-bromo-5-nitro-1,3-dioxane",0.4,5000,{"$f":"C118/D118","v":8e-05},null,null,{"$f":"E118","v":8e-05},1,"P","O"]
[2404,"2-bromo-2-nitropropane-1,3-diol (Remark: Formaldehyde donor)",0.78,1000,{"$f":"C119/D119","v":0.00078},0.1,10,{"$f":"F119/G119","v":0.01},0.15,"R","O"]
[2405,"Chloroacetamide      ",4.81,1000,0.0048,null,null,0.0048,0.05,"R","O"]
[2406,"Diazolinidylurea         ",35,5000,{"$f":"C121/D121","v":0.007},null,null,{"$f":"E121","v":0.007},1,"P","O"]
[2407,"Formaldehyde               ",2,1000,{"$f":"C122/D122","v":2E-3},null,null,{"$f":"E122","v":2E-3},0.05,"R","O"]
[2408,"Glutaraldehyde         ",0.375,1000,{"$f":"C123/D123","v":0.000375},0.0223,10,{"$f":"F123/G123","v":0.00223},0.05,"R","O"]
[2410,"CMI + MI in mixture 3:1 (CAS 55965-84-9) (§)",0.048,1000,{"$f":"C124/D124","v":4.8e-05},0.0012,10,{"$f":"F124/G124","v":1.1999999999999999E-4},0.5,"I","O"]
[2411,"2-Methyl-2H-isothiazol-3-one (MI)",0.16,1000,{"$f":"C125/D125","v":0.00016},0.03,10,{"$f":"F125/G125","v":0.003},0.5,"I","O"]
[2412,"Methyldibromoglutaronitrile",0.15,1000,{"$f":"C126/D126","v":0.00015},null,null,{"$f":"E126","v":0.00015},0.05,"R","O"]
[2413,"Methyl-, Ethyl- and Propylparaben",15.4,5000,{"$f":"C127/D127","v":3.0800000000000003E-3},null,null,{"$f":"E127","v":3.0800000000000003E-3},0.05,"R","N"]
[2414,"o-Phenylphenol          ",1.1,1000,{"$f":"C128/D128","v":0.0011},0.009,10,{"$f":"F128/G128","v":0.0009},0.05,"R","O"]
[2415,"Sodium benzoate          ",24.8,1000,{"$f":"C129/D129","v":0.0248},0.09,50,{"$f":"F129/G129","v":1.8E-3},0.05,"R","Y"]
[2416,"Sodium hydroxy methyl glycinate",36.5,5000,{"$f":"C130/D130","v":0.0073},null,null,{"$f":"E130","v":0.0073},1,"O","O"]
[2418,"Triclosan                   ",1.4E-3,1000,{"$f":"C131/D131","v":1.4e-06},0.00069,10,{"$f":"F131/G131","v":6.9e-05},0.5,"I","O"]
[2419,"Phenoxy-ethanol",291,1000,{"$f":"C132/D132","v":0.291},9.43,10,{"$f":"+F132/G132","v":0.943},0.05,"R","O"]
[2420,"Sorbate and sorbic acid",24.1,1000,{"$f":"C133/D133","v":0.0241},null,null,{"$f":"E133","v":0.0241},0.05,"R","O"]
[2421,"N-(3-Aminopropyl)-N-dodecylpropane-1,3-diamine",0.027,1000,{"$f":"C134/D134","v":2.7e-05},0.0085,50,0.00017,0.05,"R","O"]
[2422,"Phenoxypropanol",100,1000,{"$f":"C135/D135","v":0.1},null,null,0.1,0.05,"R","O"]
[2423,"Dehydroacetic acid",32.1,5000,{"$f":"C136/D136","v":0.00642},null,null,{"$f":"E136","v":0.00642},0.15,"R","O"]
[]
[null,"Other ingredients"]
[2502,"Paraffin (CAS 8002-74-2)                  ",100,1000,0.1,100,10,10,1,"P","O"]
[2503,"Glycerol, sorbitol and xylitol                  ",885,5000,{"$f":"C140/D140","v":0.177},null,null,{"$f":"E140","v":0.177},0.05,"R","Y"]
[2504,"Phosphate, as STPP   ",160,1000,{"$f":"C141/D141","v":0.16},null,null,{"$f":"E141","v":0.16},0.05,"NA","NA"]
[2505,"Zeolite (Insoluble inorganic)                       ",100,1000,{"$f":"C142/D142","v":0.1},100,50,{"$f":"F142/G142","v":2},1,"NA","NA"]
[2506,"Citrate and citric acid                      ",825,1000,{"$f":"C143/D143","v":0.825},80,50,{"$f":"F143/G143","v":1.6},0.05,"R","Y"]
[2507,"Polycarboxylates homopolymer of acrylic acid                ",40,1000,{"$f":"C144/D144","v":0.04},12,10,{"$f":"F144/G144","v":1.2},1,"P","N"]
[2508,"Polycarboxylates copolymer of acrylic/maleic acid               ",100,1000,{"$f":"C145/D145","v":0.1},5.8,10,{"$f":"F145/G145","v":0.58},1,"P","N"]
[2509,"Nitrilotriacetat (NTA)",494,1000,{"$f":"C146/D146","v":0.494},64,50,{"$f":"F146/G146","v":1.28},0.05,"R","N"]
[2510,"GLDA",100,1000,{"$f":"C147/D147","v":0.1},100,10,{"$f":"F147/G147","v":10},0.05,"R","Y"]
[2511,"EDTA                        ",121,1000,{"$f":"C148/D148","v":0.121},22,50,{"$f":"F148/G148","v":0.44},0.5,"I","N"]
[2512,"Phosphonates             ",650,1000,{"$f":"C149/D149","v":0.65},25,50,{"$f":"F149/G149","v":0.5},1,"P","N"]
[2513,"EDDS                         ",5.5,1000,{"$f":"C150/D150","v":0.0055},0.66,10,{"$f":"F150/G150","v":0.066},0.05,"R","N"]
[2514,"Carboxymethyl inulin (CMI)",1000,1000,{"$f":"C151/D151","v":1},423,10,{"$f":"F151/G151","v":42.3},0.5,"I","N"]
[2515,"Clay (Insoluble inorganic)          ",null,null,10,null,null,10,1,"NA","NA"]
[2516,"Carbonates                  ",null,null,10,null,null,10,0.05,"NA","NA"]
[2517,"Veg. Oil",100,1000,{"$f":"C154/D154","v":0.1},null,null,{"$f":"E154","v":0.1},0.05,"R","Y"]
[2519,"Lauric Acid (C12:0)",3.6,1000,{"$f":"C155/D155","v":0.0036},0.47,10,{"$f":"F155/G155","v":0.047},0.05,"R","Y"]
[2520,"Fatty acids, C≥14-C≤22 (even numbered) (Remark: soap is listed in DID 2025)    ",100,1000,0.1,100,50,2,0.05,"R","Y"]
[2521,"Fatty acid, C≥6-C≤12 methyl ester",21,10000,{"$f":"C157/D157","v":0.0021},null,null,{"$f":"+E157","v":0.0021},0.05,"R","Y"]
[2522,"Lanolin",100,1000,{"$f":"C158/D158","v":0.1},null,null,{"$f":"E158","v":0.1},0.05,"R","O"]
[2523,"Soluble Silicates                   ",207,1000,{"$f":"C159/D159","v":0.207},null,null,{"$f":"E159","v":0.207},1,"NA","NA"]
[2524,"Polyasparaginic acid, Na-salt",410,1000,{"$f":"C160/D160","v":0.41},null,null,{"$f":"E160","v":0.41},0.05,"R","N"]
[2525,"Perborates (as Boron)",14,1000,{"$f":"C161/D161","v":0.014},null,null,{"$f":"E161","v":0.014},1,"NA","NA"]
[2526,"Percarbonate",4.9,1000,{"$f":"C162/D162","v":0.004900000000000001},0.7,50,{"$f":"F162/G162","v":0.013999999999999999},0.01,"NA","NA"]
[2527,"H2O2",2.4,1000,{"$f":"C163/D163","v":0.0024},0.22,50,{"$f":"F163/G163","v":0.0044},0.01,"NA","NA"]
[2528,"Tetraacetylethylenediamine (TAED)",250,1000,{"$f":"C164/D164","v":0.25},500,50,10,0.05,"R","Y"]
[2529,"C1-C3 alcohols                ",1000,1000,{"$f":"C165/D165","v":1},null,null,{"$f":"E165","v":1},0.05,"R","Y"]
[2530,"Cetyl Alcohol and Cetearyl Alcohol",100,1000,{"$f":"C166/D166","v":0.1},100,50,{"$f":"F166/G166","v":2},0.05,"R","Y"]
[2531,"Mono-, di- and triethanol amine",90,1000,{"$f":"C167/D167","v":0.09},0.78,50,{"$f":"F167/G167","v":0.015600000000000001},0.05,"R","Y"]
[2532,"Polyvinylpyrrolidon (PVP)",1000,1000,{"$f":"C168/D168","v":1},null,null,{"$f":"E168","v":1},0.5,"I","N"]
[2533,"Carboxymethylcellulose (CMC)",250,5000,{"$f":"C169/D169","v":0.05},null,null,{"$f":"E169","v":0.05},0.5,"I","N"]
[2534,"Sodium and magnesium sulphate        ",null,null,10,null,null,10,0.05,"NA","NA"]
[2535,"Calcium- and sodium chloride ",null,null,10,null,null,10,1,"NA","NA"]
[2536,"Urea                          ",9100,5000,{"$f":"C172/D172","v":1.82},null,null,{"$f":"E172","v":1.82},0.5,"I","O"]
[2537,"Silicon dioxide, crystalline and amorphous (insoluble inorganic)",null,null,10,null,null,10,1,"NA","NA"]
[2538,"Polyethylene glycol, MW≥4100",1000,10000,{"$f":"C174/D174","v":0.1},null,null,{"$f":"E174","v":0.1},0.05,"R","N"]
[2539,"Polyethylene glycol, MW<4100",1000,10000,{"$f":"C175/D175","v":0.1},null,null,{"$f":"E175","v":0.1},0.05,"R","Y"]
[2540,"Cumene sulphonates",450,1000,{"$f":"C176/D176","v":0.45},null,null,{"$f":"E176","v":0.45},0.05,"R","O"]
[2541,"Xylene sulphonate",230,1000,{"$f":"C177/D177","v":0.23},31,100,{"$f":"F177/G177","v":0.31},0.15,"R","N"]
[2542,"Na-/Mg-/KOH         ",null,null,10,null,null,10,0.05,"NA","NA"]
[2543,"Ammonia",28,1000,{"$f":"C179/D179","v":0.028},0.05,10,{"$f":"F179/G179","v":0.005},0.05,"NA","NA"]
[2544,"Proteins except enzymes",25,5000,{"$f":"C180/D180","v":0.005},null,null,{"$f":"E180","v":0.005},0.05,"R","Y"]
[2545,"Proteinhydrolizates, wheatgluten",113,5000,{"$f":"C181/D181","v":{"v":0.0226,"d":"0.023"}},null,null,{"$f":"+E181","v":{"v":0.0226,"d":"0.023"}},0.05,"R","O"]
[2546,"Protease (active enzyme protein)",0.17,1000,{"$f":"C182/D182","v":0.00017},0.006,10,{"$f":"F182/G182","v":6.0000000000000006E-4},0.01,"R","Y"]
[2547,"Non-protease (active enzyme protein)",18,1000,{"$f":"C183/D183","v":0.018},null,null,{"$f":"E183","v":0.018},0.01,"R","Y"]
[2548,"But-2-one (MEK)",1972,1000,{"$f":"C184/D184","v":1.972},null,null,{"$f":"+E184","v":1.972},0.05,"R","O"]
[2549,"Perfume, if not other specified (**)",2,1000,{"$f":"C185/D185","v":2E-3},null,null,{"$f":"E185","v":2E-3},0.5,"I","N"]
[2550,"Dyes, if not other specified (**)",10,1000,{"$f":"C186/D186","v":0.01},null,null,{"$f":"E186","v":0.01},1,"P","N"]
[2551,"Polysaccarides including starch",100,1000,{"$f":"C187/D187","v":0.1},null,null,{"$f":"E187","v":0.1},0.05,"R","Y"]
[2552,"Anionic polyester       ",655,1000,{"$f":"C188/D188","v":0.655},null,null,{"$f":"E188","v":0.655},1,"P","O"]
[2553,"PVNO/PVPI                              ",530,1000,{"$f":"C189/D189","v":0.53},null,null,{"$f":"E189","v":0.53},1,"P","N"]
[2554,"Zn Ftalocyanin sulphonate",0.2,1000,{"$f":"C190/D190","v":0.0002},0.16,100,{"$f":"F190/G190","v":0.0016},1,"P","N"]
[2555,"Iminodisuccinat ",81,1000,{"$f":"C191/D191","v":0.081},11.7,50,0.234,0.05,"R","N"]
[2556,"Flourescent Whitening Agents 1",100,1000,0.1,5.5,50,0.11,0.5,"I","N"]
[2557,"Flourescent Whitening Agents 5",10,1000,{"$f":"C193/D193","v":0.01},1,10,{"$f":"F193/G193","v":0.1},1,"P","N"]
[2558,"1-decanol                 ",4.225,1000,{"$f":"C194/D194","v":0.004225},0.11,50,{"$f":"F194/G194","v":0.0022},0.05,"R","O"]
[2559,"Methyl laurate          ",0.26,1000,{"$f":"C195/D195","v":2.6000000000000003E-4},0.0396,50,{"$f":"F195/G195","v":{"v":7.9200000000000006E-4,"d":"0.00079"}},0.05,"R","O"]
[2560,"Formic acid (Ca salt)",100,1000,{"$f":"C196/D196","v":0.1},null,null,{"$f":"E196","v":0.1},0.05,"R","Y"]
[2561,"Adipic acid               ",31,1000,{"$f":"C197/D197","v":0.031},null,null,{"$f":"E197","v":0.031},0.05,"R","O"]
[2562,"Maleic acid               ",106,1000,{"$f":"C198/D198","v":0.106},null,null,{"$f":"E198","v":0.106},0.05,"R","Y"]
[2563,"Malic acid                 ",106,1000,{"$f":"C199/D199","v":0.106},null,null,{"$f":"E199","v":0.106},0.05,"R","O"]
[2564,"Tartaric acid            ",51,1000,0.051,null,null,0.051,0.05,"R","O"]
[2565,"Phosphoric acid       ",138,1000,{"$f":"C201/D201","v":0.138},null,null,{"$f":"E201","v":0.138},0.05,"NA","NA"]
[2566,"Oxalic acid               ",128,5000,{"$f":"C202/D202","v":0.0256},null,null,{"$f":"E202","v":0.0256},0.05,"R","O"]
[2567,"Acetic acid               ",30,1000,{"$f":"C203/D203","v":0.03},null,null,{"$f":"E203","v":0.03},0.05,"R","Y"]
[2568,"Lactic acid                ",130,1000,{"$f":"C204/D204","v":0.13},null,null,{"$f":"E204","v":0.13},0.05,"R","Y"]
[2569,"Sulphamic acid           ",48,1000,{"$f":"C205/D205","v":0.048},null,null,{"$f":"E205","v":0.048},1,"NA","NA"]
[2570,"Salicylic acid            ",100,1000,0.1,10,50,0.2,0.05,"R","O"]
[2571,"Glycolic acid            ",31.2,1000,{"$f":"C207/D207","v":0.0312},null,null,{"$f":"E207","v":0.0312},0.05,"R","O"]
[2572,"Glutaric acid            ",208,5000,{"$f":"C208/D208","v":0.0416},null,null,{"$f":"E208","v":0.0416},0.05,"R","O"]
[2573,"Malonic acid             ",95,5000,{"$f":"C209/D209","v":0.019},null,null,{"$f":"E209","v":0.019},0.05,"R","O"]
[2574,"Ethylene glycol         ",6500,1000,{"$f":"C210/D210","v":6.5},null,null,{"$f":"E210","v":6.5},0.05,"R","Y"]
[2575,"Ethylene glycol monobutyl ether",911,1000,{"$f":"C211/D211","v":0.911},88,10,{"$f":"F211/G211","v":8.8},0.05,"R","Y"]
[2576,"Diethylene glycol        ",4400,1000,{"$f":"C212/D212","v":4.4},100,10,{"$f":"F212/G212","v":10},0.05,"R","Y"]
[2577,"Diethylene glycol monomethyl ether",500,1000,{"$f":"C213/D213","v":0.5},null,null,{"$f":"E213","v":0.5},0.05,"R","O"]
[2578,"Diethylene glycol monoethyl ether",3940,5000,{"$f":"C214/D214","v":0.788},null,null,{"$f":"E214","v":0.788},0.05,"R","O"]
[2579,"Diethylene glycol monobutyl ether",1254,1000,{"$f":"C215/D215","v":1.254},null,null,{"$f":"E215","v":1.254},0.05,"R","O"]
[2580,"Diethylene glycol dimethylether",943,1000,{"$f":"C216/D216","v":0.943},320,50,{"$f":"F216/G216","v":6.4},0.5,"I","O"]
[2581,"Propylene glycol       ",32000,1000,{"$f":"C217/D217","v":32},null,null,{"$f":"E217","v":32},0.05,"R","Y"]
[2582,"Propylene glycol monomethyl ether",500,1000,{"$f":"C218/D218","v":0.5},null,null,{"$f":"E218","v":0.5},0.05,"R","O"]
[2583,"Propylene glycol monobutylether",{"v":762.5,"d":"763"},1000,{"$f":"C219/D219","v":{"v":0.7625,"d":"0.76"}},null,null,{"$f":"E219","v":{"v":0.7625,"d":"0.76"}},0.05,"R","O"]
[2584,"Dipropylene glycol     ",109,1000,{"$f":"C220/D220","v":0.109},172.5,50,{"$f":"F220/G220","v":3.45},0.05,"R","O"]
[2585,"Dipropylene glycol monomethyl ether",969,1000,{"$f":"C221/D221","v":0.969},0.5,50,{"$f":"F221/G221","v":0.01},0.05,"R","O"]
[2586,"Dipropylene glycol monobutylether",841,1000,{"$f":"C222/D222","v":0.841},null,null,{"$f":"E222","v":0.841},0.05,"R","O"]
[2587,"Dipropylene glycol dimethylether",1000,5000,{"$f":"C223/D223","v":0.2},null,null,{"$f":"E223","v":0.2},0.5,"I","O"]
[2588,"Triethylene glycol      ",4400,1000,{"$f":"C224/D224","v":4.4},null,null,{"$f":"E224","v":4.4},0.5,"I","O"]
[2589,"Tall oil                      ",1.8,1000,{"$f":"C225/D225","v":1.8E-3},null,null,{"$f":"E225","v":1.8E-3},0.05,"R","O"]
[2590,"Ethylenebisstearamides",100,5000,{"$f":"C226/D226","v":0.02},null,null,{"$f":"E226","v":0.02},0.5,"I","O"]
[2591,"Sodium gluconate      ",10000,10000,{"$f":"C227/D227","v":1},null,null,{"$f":"E227","v":1},0.05,"R","Y"]
[2592,"Glycol distearate       ",100,1000,{"$f":"C228/D228","v":0.1},100,50,{"$f":"F228/G228","v":2},0.05,"R","Y"]
[2593,"Hydroxyl ethyl cellulose",209,5000,{"$f":"C229/D229","v":0.0418},null,null,{"$f":"E229","v":0.0418},1,"P","O"]
[2594,"Hydroxypropyl methyl cellulose",188,5000,{"$f":"C230/D230","v":0.0376},null,null,{"$f":"E230","v":0.0376},1,"P","O"]
[2595,"1-methyl-2-pyrrolidone",600,1000,{"$f":"C231/D231","v":0.6},12.5,50,{"$f":"F231/G231","v":0.25},0.05,"R","O"]
[2596,"Xanthan gum             ",490,1000,{"$f":"C232/D232","v":0.49},null,null,{"$f":"E232","v":0.49},0.05,"R","O"]
[2597,"Trimethyl pentanediol mono-isobutyrate",18,1000,{"$f":"C233/D233","v":0.018},3.3,100,{"$f":"F233/G233","v":0.033},0.05,"R","O"]
[2598,"Benzotriazole           ",75,1000,{"$f":"C234/D234","v":0.075},5.6,50,{"$f":"F234/G234","v":0.11199999999999999},1,"P","O"]
[2599,"Piperidinol-propanetricarboxylate salt",100,1000,{"$f":"C235/D235","v":0.1},120,100,{"$f":"F235/G235","v":1.2},0.5,"I","O"]
[2600,"Diethylaminopropyl-DAS",120,1000,{"$f":"C236/D236","v":0.12},120,100,{"$f":"F236/G236","v":1.2},1,"P","O"]
[2601,"Methylbenzamide-DAS",120,1000,{"$f":"C237/D237","v":0.12},120,100,{"$f":"F237/G237","v":1.2},0.5,"I","O"]
[2602,"Pentaerythritol-tetrakis-phenol-propionate",38,1000,{"$f":"C238/D238","v":0.038},null,null,{"$f":"E238","v":0.038},1,"P","O"]
[2603,"Block polymers (***)     ",100,5000,{"$f":"C239/D239","v":0.02},null,null,{"$f":"E239","v":0.02},1,"P","N"]
[2604,"Denatonium benzoate",13,5000,{"$f":"C240/D240","v":0.0026},null,null,{"$f":"E240","v":0.0026},1,"O","O"]
[2605,"Succinate                   ",40.7,1000,{"$f":"C241/D241","v":0.0407},null,null,{"$f":"E241","v":0.0407},0.05,"R","O"]
[2606,"Polyaspartic acid          ",528,1000,{"$f":"C242/D242","v":0.528},null,null,{"$f":"E242","v":0.528},0.05,"R","N"]
[2607,"Mn-saltren (CAS 61007-89-4)",39,1000,{"$f":"C243/D243","v":0.039},4.3,100,{"$f":"+F243/G243","v":0.043},0.5,"I","O"]
[2608,"Tri-sodium methylglycine diacetat",100,1000,{"$f":"C244/D244","v":0.1},100,10,{"$f":"+F244/G244","v":10},0.05,"R","Y"]
[2609,"Tocopherol acetate",100,1000,{"$f":"C245/D245","v":0.1},100,50,{"$f":"F245/G245","v":2},1,"P","O"]
[2610,"Ethylhexyl salicylate",100,1000,{"$f":"C246/D246","v":0.1},null,null,0.1,0.05,"R","O"]
[2611,"Ethylhexyl triazone",100,1000,{"$f":"C247/D247","v":0.1},null,null,0.1,1,"P","O"]
[2612,"Octocrilene",100,1000,{"$f":"C248/D248","v":0.1},null,null,0.1,1,"P","O"]
[2613,"Bis-ethylhexyloxyphenol methoxyphenyl triazine",100,1000,{"$f":"C249/D249","v":0.1},null,null,0.1,1,"P","O"]
[2614,"Butyl methoxydibenzoylmethane",100,1000,{"$f":"C250/D250","v":0.1},null,null,0.1,1,"P","O"]
[2615,"e-phthaloimidoperoxyhexanoic acid",0.59,5000,{"$f":"C251/D251","v":1.18E-4},null,null,{"$f":"E251","v":1.18E-4},0.05,"R","O"]
[2616,"Methanesulphonic acid",7.4,1000,{"$f":"C252/D252","v":0.0074},null,null,{"$f":"E252","v":0.0074},0.05,"R","Y"]
[2617,"Aloe vera",100,5000,{"$f":"C253/D253","v":0.02},null,null,{"$f":"E253","v":0.02},0.05,"R","O"]
[2618,"Panthenol",100,1000,{"$f":"C254/D254","v":0.1},null,null,{"$f":"E254","v":0.1},0.05,"R","O"]
[2619,"Caprylyl glycol",2.2,1000,{"$f":"C255/D255","v":0.0022},null,null,{"$f":"E255","v":0.0022},0.05,"R","Y"]
[2620,"Glycerides, C14-18 and C16-18-unsatd. mono-, di- and tri-",100,1000,{"$f":"C256/D256","v":0.1},100,50,{"$f":"+F256/G256","v":2},0.05,"R","Y"]
[2621,"Linear polydimethylsiloxanes",100,1000,{"$f":"C257/D257","v":0.1},null,null,{"$f":"E257","v":0.1},1,"P","N"]
[2622,"Ethylhexylglycerin",60.2,1000,0.060200000000000004,1.5,50,0.03,0.5,"I","O"]
[2623,"Triethyl citrate",100,5000,0.02,null,null,0.02,0.05,"R","O"]
[2624,"Isopropyl laurate",100,1000,0.1,null,null,0.1,0.15,"R","O"]
[2625,"Butylene glycol",100,1000,0.1,null,null,0.1,0.05,"R","O"]
[2626,"Pentylene glycol",500,1000,0.5,5477,100,54.77,0.05,"R","O"]
[2627,"Hexylene glycol",429,1000,0.429,null,null,0.429,0.05,"R","O"]
[2628,"Trimethylene glycol",7417,1000,7.417,null,null,7.417,0.05,"R","O"]
[2629,"Ethylhexyl stearate",100,1000,0.1,1,50,0.02,0.05,"R","Y"]
[2630,"Diethylamino hydroxybenzoyl hexyl benzoate ",100,1000,0.1,0.0088,10,0.00088,1,"P","O"]
[2631,"C12-15 alkyl benzoate",100,5000,0.02,0.00112,10,1.1199999999999998E-4,0.05,"R","N"]
[2632,"Phenylbenzimidazole sulfonic acid",100,1000,0.1,100,50,2,1,"P","N"]
[2633,"Cera alba (bees wax)",1,10000,{"$f":"C269/D269","v":1E-4},null,null,{"$f":"E269","v":1E-4},0.5,"I","O"]
[2634,"Guar hydroxypropyltrimonium chloride",54,1000,{"$f":"C270/D270","v":0.054},100,50,{"$f":"+F270/G270","v":2},0.05,"R","O"]
[2635,"Hydroxypropyl guar hydroxypropyltrimonium chloride",100,10000,{"$f":"C271/D271","v":0.01},null,null,{"$f":"E271","v":0.01},1,"P","O"]
[2636,"1,2-hexanediol",100,1000,{"$f":"C272/D272","v":0.1},null,null,{"$f":"E272","v":0.1},0.05,"R","O"]
[2637,"4-formylphenylboronic acid (4-FPBA)",10.7,1000,{"$f":"C273/D273","v":0.0107},null,null,{"$f":"E273","v":0.0107},0.05,"R","O"]
[2638,"Sodium PCA",100,1000,{"$f":"C274/D274","v":0.1},null,null,{"$f":"E274","v":0.1},0.05,"R","O"]
[2639,"Niacinamide",1000,1000,{"$f":"C275/D275","v":1},null,null,{"$f":"E275","v":1},0.05,"R","O"]
[2640,"Aluminium chlorohydrate",0.357,1000,{"$f":"C276/D276","v":3.57E-4},0.0715,100,{"$f":"+F276/G276","v":7.1499999999999992E-4},1,"O","O"]
[2641,"Allantoin",100,1000,{"$f":"C277/D277","v":0.1},null,null,{"$f":"E277","v":0.1},0.05,"R","O"]
[2642,"Betaine ",1199,5000,{"$f":"C278/D278","v":0.2398},null,null,{"$f":"E278","v":0.2398},0.15,"R","O"]
[2643,"Isopropyl myristate",100,1000,{"$f":"C279/D279","v":0.1},null,null,{"$f":"E279","v":0.1},0.05,"R","O"]
[2644,"Isopropyl palmitate",100,1000,{"$f":"C280/D280","v":0.1},null,null,{"$f":"E280","v":0.1},0.05,"R","Y"]
[2645,"Ascorbyl palmitate",50,5000,{"$f":"C281/D281","v":0.01},null,null,{"$f":"E281","v":0.01},0.05,"R","O"]
[2646,"Cetyl palmitate",100,1000,{"$f":"C282/D282","v":0.1},100,50,{"$f":"F282/G282","v":2},0.05,"R","O"]
[]
[]
["Insoluble inorganic  - Inorganic ingredient with very low, or no ability to dissolve in water."]
["(*)","If no acceptable toxicity data was found, these columns are empty. In that case TF(chronic) is defined as equal to TF(acute) and vice versa"]
["(**)","As a general rule licence applicants must use the data on the list. Perfumes and dyes are exceptions. If toxicity data is submitted by the licence "]
[null,"applicant the submitted data shall be used to calculate the TF and determine the degradability. If not, the values on the list shall be used. "]
["(***) ","The applicants data on aerobic degradability of DID no. 2603 Block polymers will be accepted after presentation of test-report."]
["(§) ","5-Chloro-2-Methyl-4-isothiazolin-3-one and 2-Methyl-4-isothiazolin-3-one in mixture 3:1"]
[]
["List of abbreviations:"]
["SF(acute) ","Safety factor for acute toxicity."]
["TF(acute) ","Toxicity factor based on acute toxicity on aquatic organisms."]
["SF(chronic) ","Safety factor for chronic toxicity."]
["TF(chronic) ","Toxicity factor based on chronic toxicity on aquatic organisms."]
["DF ","Degradation factor."]
["Aerobic degradation:"]
["R ","Readily biodegradable according to OECD guidelines."]
["I","Inherently biodegradable according to OECD guidelines."]
["P ","Persistent. The ingredient has failed the test for inherent biodegradability."]
["O ","The ingredient has not been tested."]
["NA ","Not applicable"]
["Anaerobic degradation:"]
["Y ","Biodegradable under anaerobic conditions."]
["N ","Not biodegradable under anaerobic conditions."]
["O ","The ingredient has not been tested."]
["NA ","Not applicable"]